[Date Prev][Date Next][Thread Prev][Thread Next][Date Index][Thread Index]

[netCDF #YNZ-664197]: Re: Failed netcdf check



Hello,

This is a known issue related to a change in our test server
configuration. Recent releases fix it by pointing directly 
to our new test servers. So, the failure is on our end, not 
yours.

You can complete testing and installation of earlier releases
the netCDF C library and utilities by following these steps:

  1. Run "make clean" in the top level directory of your source netCDF
     source (or unpack the source again in a new source directory)

  2. Run the "configure" script again, but this time add the following
     option to whatever options you previously specified:

       --disable-dap-remote-tests 

  3. Run "make check" and verify that it now completes successfully.

  4. Run "make install", or "sudo make install" if needed.

That should get you past the problem with our test server and allow
the installation to complete successfully.  Please let us know if you
encounter additional errors.

I hope this helps,

-Ward

> Hi,
> 
> I am trying to install netcdf-4.3.3. I have run the configure script
> and the make script. When I ran the make check, there was one failure
> with the following message (Please find attached the test-suite.log file):
> 
> 
> PASS: tst_ncdap3.sh
> PASS: t_dap3a
> PASS: test_cvt3
> PASS: test_vara
> PASS: tst_remote3.sh
> PASS: tst_formatx.sh
> PASS: test_partvar
> PASS: testurl.sh
> FAIL: test_varm3
> PASS: test_nstride_cached
> PASS: t_misc
> ============================================================================
> Testsuite summary for netCDF 4.3.3
> ============================================================================
> # TOTAL: 11
> # PASS:  10
> # SKIP:  0
> # XFAIL: 0
> # FAIL:  1
> # XPASS: 0
> # ERROR: 0
> ============================================================================
> See ncdap_test/test-suite.log
> Please report to address@hidden
> ============================================================================
> make[5]: *** [test-suite.log] Error 1
> make[5]: Leaving directory 
> `/home/reason/RegCM-4.2/software/src/netcdf-4.3.3/ncdap_test'
> make[4]: *** [check-TESTS] Error 2
> make[4]: Leaving directory 
> `/home/reason/RegCM-4.2/software/src/netcdf-4.3.3/ncdap_test'
> make[3]: *** [check-am] Error 2
> make[3]: Leaving directory 
> `/home/reason/RegCM-4.2/software/src/netcdf-4.3.3/ncdap_test'
> make[2]: *** [check-recursive] Error 1
> make[2]: Leaving directory 
> `/home/reason/RegCM-4.2/software/src/netcdf-4.3.3/ncdap_test'
> make[1]: *** [check] Error 2
> make[1]: Leaving directory 
> `/home/reason/RegCM-4.2/software/src/netcdf-4.3.3/ncdap_test'
> make: *** [check-recursive] Error 1
> 
> Please give me advice on how I should proceed.
> 
> Regards,
> 
> Reason Machete
> 
> 



Ticket Details
===================
Ticket ID: YNZ-664197
Department: Support netCDF
Priority: Normal
Status: Closed


NOTE: All email exchanges with Unidata User Support are recorded in the Unidata inquiry tracking system and then made publicly available through the web. If you do not want to have your interactions made available in this way, you must let us know in each email you send to us.