[Date Prev][Date Next][Thread Prev][Thread Next][Date Index][Thread Index]

[netCDF #EPZ-611714]: Installation trouble



> Sure, it's very long though.  Thanks again for the help. -Maggie

OK, thanks.  This looks like the error that occurs when a test server for
the OPeNDAP remote access is down, so please follow the instructions here
to complete the build:

  http://www.unidata.ucar.edu/support/help/MailArchives/netcdf/msg10778.html

--Russ

> *** Testing: stride case 3
> *** Pass: stride case 3
> PASS: test_varm3
> syntax error, unexpected SCAN_WORD, expecting SCAN_ATTR or SCAN_DATASET or
> SCAN_ERROR
> context: <html^><head><title>Apache Tomcat/6.0.29 - Error
> report</title><style><!--H1
> {font-family:Tahoma,Arial,sans-serif;color:white;background-color:#525D76;font-size:22px;}
> H2
> {font-family:Tahoma,Arial,sans-serif;color:white;background-color:#525D76;font-size:16px;}
> H3
> {font-family:Tahoma,Arial,sans-serif;color:white;background-color:#525D76;font-size:14px;}
> BODY
> {font-family:Tahoma,Arial,sans-serif;color:black;background-color:white;} B
> {font-family:Tahoma,Arial,sans-serif;color:white;background-color:#525D76;}
> P
> {font-family:Tahoma,Arial,sans-serif;background:white;color:black;font-size:12px;}A
> {color : black;}A.name {color : black;}HR {color : #525D76;}--></style>
> </head><body><h1>HTTP Status 404 - /dods/dts/test.06.dds</h1><HR size="1"
> noshade="noshade"><p><b>type</b> Status report</p><p><b>message</b>
> <u>/dods/dts/test.06.dds</u></p><p><b>description</b> <u>The requested
> resource (/dods/dts/test.06.dds) is not available.</u></p><HR size="1"
> noshade="noshade"><h3>Apache Tomcat/6.0.29</h3></body></html>
> Error: NetCDF: Malformed or inaccessible DAP DDS
> FAIL: test_vara
> *** Test: var conversions on URL:
> file:///Users/msavery/Desktop/DYNAMO/netcdf-4.1.3/ncdap_test/testdata3/test.02
> *** testing: string3
> *** testing: ch_data
> *** testing: int8_data
> *** testing: uint8_data
> *** testing: int8toint32_data
> *** testing: int82float32_data
> *** testing: int16_data
> *** testing: int16toint32_data
> *** testing: int162float32_data
> *** testing: int32_data
> *** testing: int32tofloat32_data
> *** testing: int32toilong_data
> *** testing: float32_data
> *** testing: float64_data
> PASS: t_dap3a
> ================================================
> 1 of 7 tests failed
> Please report to address@hidden
> ================================================
> make[4]: *** [check-TESTS] Error 1
> make[3]: *** [check-am] Error 2
> make[2]: *** [check-recursive] Error 1
> make[1]: *** [check] Error 2
> make: *** [check-recursive] Error 1

Russ Rew                                         UCAR Unidata Program
address@hidden                      http://www.unidata.ucar.edu



Ticket Details
===================
Ticket ID: EPZ-611714
Department: Support netCDF
Priority: Normal
Status: Closed


NOTE: All email exchanges with Unidata User Support are recorded in the Unidata inquiry tracking system and then made publicly available through the web. If you do not want to have your interactions made available in this way, you must let us know in each email you send to us.