[Date Prev][Date Next][Thread Prev][Thread Next][Date Index][Thread Index]

[netCDF #EPZ-611714]: Installation trouble

Hi Maggie,

> I am trying to install netcdf-4.1.3. I did:
> ./configure --prefix=/Users/msavery/Desktop/DYNAMO/netcdf --disable-netcdf-4
> make check install
> and the following occured:
> ================================================
> 1 of 7 tests failed
> Please report to address@hidden
> ================================================
> make[4]: *** [check-TESTS] Error 1
> make[3]: *** [check-am] Error 2
> make[2]: *** [check-recursive] Error 1
> make[1]: *** [check] Error 2
> make: *** [check-recursive] Error 1
> What did I do wrong, or what options do I need to specify?

We need more information to diagnose this problem.  Could you send the full
output of running "make check", so we can see which test failed? Thanks.


Russ Rew                                         UCAR Unidata Program
address@hidden                      http://www.unidata.ucar.edu

Ticket Details
Ticket ID: EPZ-611714
Department: Support netCDF
Priority: Normal
Status: Closed

NOTE: All email exchanges with Unidata User Support are recorded in the Unidata inquiry tracking system and then made publicly available through the web. If you do not want to have your interactions made available in this way, you must let us know in each email you send to us.