[Date Prev][Date Next][Thread Prev][Thread Next][Date Index][Thread Index]

[netCDF #FUE-968928]: Need some help for fail test, FAIL: tst_files6


This is a known issue related to a change in our test server
configuration. The 4.3.2 release fixed it by pointing directly 
to our new test servers. So, the failure is on our end, not 

You can complete testing and installation of earlier releases
the netCDF C library and utilities by following these steps:

  1. Run "make clean" in the top level directory of your source netCDF
     source (or unpack the source again in a new source directory)

  2. Run the "configure" script again, but this time add the following
     option to whatever options you previously specified:


  3. Run "make check" and verify that it now completes successfully.

  4. Run "make install", or "sudo make install" if needed.

That should get you past the problem with our test server and allow
the installation to complete successfully.  Please let us know if you
encounter additional errors.


> Hi
> My name is Joel and I try to install netCDF in a workstation with centos 7
> and intel Xeon processor, please help me with this error
> Regrets
> Joel
> *** Testing netcdf file functions some more.
> *** testing simple opendap open/close...Sorry! Unexpected result, 
> tst_files6.c, line: 25
> FAIL: tst_files6
> *** Testing netcdf-4 variable syncing.
> **** testing that sync works in netCDF-4...ok.
> **** testing that sync works in netCDF-4, with test contributed by Jeff 
> W....ok.
> **** testing that sync works in netCDF-4, with test contributed by Jeff 
> W....ok.
> *** Tests successful!
> PASS: tst_sync
> *** Testing netcdf-4 v2 API functions.
> *** testing simple opens and creates...ok.
> *** Tests successful!
> PASS: tst_v2
> ================================================
> 1 of 50 tests failed
> Please report to address@hidden
> ================================================
> make[2]: *** [check-TESTS] Error 1
> make[2]: se sale del directorio `/home/conacyt2/Descargas/netcdf-4.2/nc_test4'
> make[1]: *** [check-am] Error 2
> make[1]: se sale del directorio `/home/conacyt2/Descargas/netcdf-4.2/nc_test4'
> make: *** [check-recursive] Error 1

Ticket Details
Ticket ID: FUE-968928
Department: Support netCDF
Priority: Normal
Status: Closed

NOTE: All email exchanges with Unidata User Support are recorded in the Unidata inquiry tracking system and then made publicly available through the web. If you do not want to have your interactions made available in this way, you must let us know in each email you send to us.