[Date Prev][Date Next][Thread Prev][Thread Next][Date Index][Thread Index]

[netCDF #ZSV-849060]: netcdf4.1.3

Hi Felix,

> When I install the NETCDF 4.1.3, make check get the following errors:
> make[4]: *** [check-TESTS]  1
> make[4]: Leaving directory `/home/felix/wrf/netcdf-4.1.3/ncdap_test'
> make[3]: *** [check-am]  2
> make[3]: Leaving directory `/home/felix/wrf/netcdf-4.1.3/ncdap_test'
> make[2]: *** [check-recursive]  1
> make[2]: Leaving directory `/home/felix/wrf/netcdf-4.1.3/ncdap_test'
> make[1]: *** [check]  2
> make[1]: Leaving directory `/home/felix/wrf/netcdf-4.1.3/ncdap_test'

We'll need more information to diagnose the problem.  Please send the
information requested here:




Russ Rew                                         UCAR Unidata Program
address@hidden                      http://www.unidata.ucar.edu

Ticket Details
Ticket ID: ZSV-849060
Department: Support netCDF
Priority: Normal
Status: Closed

NOTE: All email exchanges with Unidata User Support are recorded in the Unidata inquiry tracking system and then made publicly available through the web. If you do not want to have your interactions made available in this way, you must let us know in each email you send to us.