Re: [gembud] Installing GEMPAK on Fedora

Hi Michael,

That seemed to work on the OpenMotif end. The packages seemed to install 
without a hitch!

However, when I run make all on GEMPAK, I'm still receiving Make 2, Make 3, 
Make 4, Make 5, etc., errors. Is there something else I'm doing wrong? Here's 
my latest Make.out.

radhdr_':
/home/gempak/NAWIPS/gempak/source/gemlib/db/dbgradhdr.c:148: undefined 
reference to `xml_transform'
/home/gempak/GEMPAK6.2.0/os/linux64/lib/gemlib.a(dbgsathdr.o): In function 
`db_gsathdr_':
/home/gempak/NAWIPS/gempak/source/gemlib/db/dbgsathdr.c:130: undefined 
reference to `xml_transform'
/home/gempak/GEMPAK6.2.0/os/linux64/lib/gemlib.a(dbgfilenames.o): In function 
`db_gFileNames':
/home/gempak/NAWIPS/gempak/source/gemlib/db/dbgfilenames.c:175: undefined 
reference to `xml_transform'
/home/gempak/GEMPAK6.2.0/os/linux64/lib/gemlib.a(dbgnextcolumn.o): In function 
`db_gNextColumn':
/home/gempak/NAWIPS/gempak/source/gemlib/db/dbgnextcolumn.c:334: undefined 
reference to `xml_transform'
collect2: ld returned 1 exit status
make[3]: *** [gdradr] Error 1
make[3]: Leaving directory `/home/gempak/GEMPAK6.2.0/unidata/programs/gdradr'
making in /home/gempak/NAWIPS/unidata/programs/gdradrc
make[3]: Entering directory `/home/gempak/GEMPAK6.2.0/unidata/programs/gdradrc'
gfortran -fno-second-underscore -fno-range-check -fd-lines-as-comments 
-I/home/gempak/GEMPAK6.2.0/gempak/include 
-I/home/gempak/GEMPAK6.2.0/os/linux64/include -g  -c gdradrc.f
gfortran -fno-second-underscore -fno-range-check -fd-lines-as-comments 
-I/home/gempak/GEMPAK6.2.0/gempak/include 
-I/home/gempak/GEMPAK6.2.0/os/linux64/include -g   gdradrc.o 
/home/gempak/GEMPAK6.2.0/os/linux64/lib/gdradrc.a 
/home/gempak/GEMPAK6.2.0/os/linux64/lib/ginitp_alt.o 
/home/gempak/GEMPAK6.2.0/os/linux64/lib/gendp_alt.o 
/home/gempak/GEMPAK6.2.0/os/linux64/lib/gemlib.a 
/home/gempak/GEMPAK6.2.0/os/linux64/lib/cgemlib.a 
/home/gempak/GEMPAK6.2.0/os/linux64/lib/gplt.a 
/home/gempak/GEMPAK6.2.0/os/linux64/lib/device.a 
/home/gempak/GEMPAK6.2.0/os/linux64/lib/gn.a 
/home/gempak/GEMPAK6.2.0/os/linux64/lib/gemlib.a 
/home/gempak/GEMPAK6.2.0/os/linux64/lib/cgemlib.a 
/home/gempak/GEMPAK6.2.0/os/linux64/lib/textlib.a 
/home/gempak/GEMPAK6.2.0/os/linux64/lib/libxml2.a 
/home/gempak/GEMPAK6.2.0/os/linux64/lib/libxslt.a 
/home/gempak/GEMPAK6.2.0/os/linux64/lib/libz.a  -lm -o gdradrc
/home/gempak/GEMPAK6.2.0/os/linux64/lib/gemlib.a(dbgfilenames.o): In function 
`db_gFileNames':
/home/gempak/NAWIPS/gempak/source/gemlib/db/dbgfilenames.c:175: undefined 
reference to `xml_transform'
/home/gempak/GEMPAK6.2.0/os/linux64/lib/gemlib.a(dbgnextcolumn.o): In function 
`db_gNextColumn':
/home/gempak/NAWIPS/gempak/source/gemlib/db/dbgnextcolumn.c:334: undefined 
reference to `xml_transform'
collect2: ld returned 1 exit status
make[3]: *** [gdradrc] Error 1
make[3]: Leaving directory `/home/gempak/GEMPAK6.2.0/unidata/programs/gdradrc'
making in /home/gempak/NAWIPS/unidata/programs/nex2gini
make[3]: Entering directory `/home/gempak/GEMPAK6.2.0/unidata/programs/nex2gini'
gfortran -fno-second-underscore -fno-range-check -fd-lines-as-comments 
-I/home/gempak/GEMPAK6.2.0/gempak/include 
-I/home/gempak/GEMPAK6.2.0/os/linux64/include -g   nex2gini.f 
/home/gempak/GEMPAK6.2.0/os/linux64/lib/nex2gini.a 
/home/gempak/GEMPAK6.2.0/os/linux64/lib/ginitp_alt.o 
/home/gempak/GEMPAK6.2.0/os/linux64/lib/gendp_alt.o 
/home/gempak/GEMPAK6.2.0/os/linux64/lib/gemlib.a 
/home/gempak/GEMPAK6.2.0/os/linux64/lib/gplt.a 
/home/gempak/GEMPAK6.2.0/os/linux64/lib/device.a 
/home/gempak/GEMPAK6.2.0/os/linux64/lib/gif.a 
/home/gempak/GEMPAK6.2.0/os/linux64/lib/gn.a 
/home/gempak/GEMPAK6.2.0/os/linux64/lib/gemlib.a 
/home/gempak/GEMPAK6.2.0/os/linux64/lib/cgemlib.a 
/home/gempak/GEMPAK6.2.0/os/linux64/lib/gemlib.a 
/home/gempak/GEMPAK6.2.0/os/linux64/lib/libnetcdf.a 
/home/gempak/GEMPAK6.2.0/os/linux64/lib/libpng.a 
/home/gempak/GEMPAK6.2.0/os/linux64/lib/textlib.a 
/home/gempak/GEMPAK6.2.0/os/linux64/lib/libxml2.a 
/home/gempak/GEMPAK6.2.0/os/linux64/lib/libxslt.a 
/home/gempak/GEMPAK6.2.0/os/linux64/lib/libz.a 
/home/gempak/GEMPAK6.2.0/os/linux64/lib/cgemlib.a 
/home/gempak/GEMPAK6.2.0/os/linux64/lib/rsl.a 
/home/gempak/GEMPAK6.2.0/os/linux64/lib/libbz2.a  -lm -o nex2gini
/home/gempak/GEMPAK6.2.0/os/linux64/lib/gemlib.a(dbgradhdr.o): In function 
`db_gradhdr_':
/home/gempak/NAWIPS/gempak/source/gemlib/db/dbgradhdr.c:148: undefined 
reference to `xml_transform'
/home/gempak/GEMPAK6.2.0/os/linux64/lib/gemlib.a(dbgsathdr.o): In function 
`db_gsathdr_':
/home/gempak/NAWIPS/gempak/source/gemlib/db/dbgsathdr.c:130: undefined 
reference to `xml_transform'
/home/gempak/GEMPAK6.2.0/os/linux64/lib/gemlib.a(dbgfilenames.o): In function 
`db_gFileNames':
/home/gempak/NAWIPS/gempak/source/gemlib/db/dbgfilenames.c:175: undefined 
reference to `xml_transform'
/home/gempak/GEMPAK6.2.0/os/linux64/lib/gemlib.a(dbgnextcolumn.o): In function 
`db_gNextColumn':
/home/gempak/NAWIPS/gempak/source/gemlib/db/dbgnextcolumn.c:334: undefined 
reference to `xml_transform'
collect2: ld returned 1 exit status
make[3]: *** [nex2gini] Error 1
make[3]: Leaving directory `/home/gempak/GEMPAK6.2.0/unidata/programs/nex2gini'
making in /home/gempak/NAWIPS/unidata/programs/nex2img
make[3]: Entering directory `/home/gempak/GEMPAK6.2.0/unidata/programs/nex2img'
gfortran -fno-second-underscore -fno-range-check -fd-lines-as-comments 
-I/home/gempak/GEMPAK6.2.0/gempak/include 
-I/home/gempak/GEMPAK6.2.0/os/linux64/include -g   nex2img.f 
/home/gempak/GEMPAK6.2.0/os/linux64/lib/nex2img.a 
/home/gempak/GEMPAK6.2.0/os/linux64/lib/ginitp_alt.o 
/home/gempak/GEMPAK6.2.0/os/linux64/lib/gendp_alt.o 
/home/gempak/GEMPAK6.2.0/os/linux64/lib/gemlib.a 
/home/gempak/GEMPAK6.2.0/os/linux64/lib/gplt.a 
/home/gempak/GEMPAK6.2.0/os/linux64/lib/device.a 
/home/gempak/GEMPAK6.2.0/os/linux64/lib/gif.a 
/home/gempak/GEMPAK6.2.0/os/linux64/lib/gn.a 
/home/gempak/GEMPAK6.2.0/os/linux64/lib/gemlib.a 
/home/gempak/GEMPAK6.2.0/os/linux64/lib/cgemlib.a 
/home/gempak/GEMPAK6.2.0/os/linux64/lib/gemlib.a 
/home/gempak/GEMPAK6.2.0/os/linux64/lib/libnetcdf.a 
/home/gempak/GEMPAK6.2.0/os/linux64/lib/rsl.a 
/home/gempak/GEMPAK6.2.0/os/linux64/lib/libbz2.a 
/home/gempak/GEMPAK6.2.0/os/linux64/lib/libpng.a 
/home/gempak/GEMPAK6.2.0/os/linux64/lib/textlib.a 
/home/gempak/GEMPAK6.2.0/os/linux64/lib/libxml2.a 
/home/gempak/GEMPAK6.2.0/os/linux64/lib/libxslt.a 
/home/gempak/GEMPAK6.2.0/os/linux64/lib/libz.a 
/home/gempak/GEMPAK6.2.0/os/linux64/lib/cgemlib.a  -lm -o nex2img
/home/gempak/GEMPAK6.2.0/os/linux64/lib/gemlib.a(dbgradhdr.o): In function 
`db_gradhdr_':
/home/gempak/NAWIPS/gempak/source/gemlib/db/dbgradhdr.c:148: undefined 
reference to `xml_transform'
/home/gempak/GEMPAK6.2.0/os/linux64/lib/gemlib.a(dbgsathdr.o): In function 
`db_gsathdr_':
/home/gempak/NAWIPS/gempak/source/gemlib/db/dbgsathdr.c:130: undefined 
reference to `xml_transform'
/home/gempak/GEMPAK6.2.0/os/linux64/lib/gemlib.a(dbgfilenames.o): In function 
`db_gFileNames':
/home/gempak/NAWIPS/gempak/source/gemlib/db/dbgfilenames.c:175: undefined 
reference to `xml_transform'
/home/gempak/GEMPAK6.2.0/os/linux64/lib/gemlib.a(dbgnextcolumn.o): In function 
`db_gNextColumn':
/home/gempak/NAWIPS/gempak/source/gemlib/db/dbgnextcolumn.c:334: undefined 
reference to `xml_transform'
collect2: ld returned 1 exit status
make[3]: *** [nex2img] Error 1
make[3]: Leaving directory `/home/gempak/GEMPAK6.2.0/unidata/programs/nex2img'
making in /home/gempak/NAWIPS/unidata/programs/gdobscnt
make[3]: Entering directory `/home/gempak/GEMPAK6.2.0/unidata/programs/gdobscnt'
gfortran -fno-second-underscore -fno-range-check -fd-lines-as-comments 
-I/home/gempak/GEMPAK6.2.0/gempak/include 
-I/home/gempak/GEMPAK6.2.0/os/linux64/include -g   gdobscnt.f 
/home/gempak/GEMPAK6.2.0/os/linux64/lib/gdobscnt.a 
/home/gempak/GEMPAK6.2.0/os/linux64/lib/ginitp_alt.o 
/home/gempak/GEMPAK6.2.0/os/linux64/lib/gendp_alt.o 
/home/gempak/GEMPAK6.2.0/os/linux64/lib/gemlib.a 
/home/gempak/GEMPAK6.2.0/os/linux64/lib/cgemlib.a 
/home/gempak/GEMPAK6.2.0/os/linux64/lib/gplt.a 
/home/gempak/GEMPAK6.2.0/os/linux64/lib/device.a 
/home/gempak/GEMPAK6.2.0/os/linux64/lib/gn.a 
/home/gempak/GEMPAK6.2.0/os/linux64/lib/gemlib.a 
/home/gempak/GEMPAK6.2.0/os/linux64/lib/textlib.a 
/home/gempak/GEMPAK6.2.0/os/linux64/lib/libxml2.a 
/home/gempak/GEMPAK6.2.0/os/linux64/lib/libxslt.a 
/home/gempak/GEMPAK6.2.0/os/linux64/lib/libz.a 
/home/gempak/GEMPAK6.2.0/os/linux64/lib/cgemlib.a 
/home/gempak/GEMPAK6.2.0/os/linux64/lib/gemlib.a  -lm -o gdobscnt
/home/gempak/GEMPAK6.2.0/os/linux64/lib/gemlib.a(dbgfilenames.o): In function 
`db_gFileNames':
/home/gempak/NAWIPS/gempak/source/gemlib/db/dbgfilenames.c:175: undefined 
reference to `xml_transform'
/home/gempak/GEMPAK6.2.0/os/linux64/lib/gemlib.a(dbgnextcolumn.o): In function 
`db_gNextColumn':
/home/gempak/NAWIPS/gempak/source/gemlib/db/dbgnextcolumn.c:334: undefined 
reference to `xml_transform'
collect2: ld returned 1 exit status
make[3]: *** [gdobscnt] Error 1
make[3]: Leaving directory `/home/gempak/GEMPAK6.2.0/unidata/programs/gdobscnt'
making in /home/gempak/NAWIPS/unidata/programs/gpnexr2
make[3]: Entering directory `/home/gempak/GEMPAK6.2.0/unidata/programs/gpnexr2'
gfortran -fno-second-underscore -fno-range-check -fd-lines-as-comments 
-I/home/gempak/GEMPAK6.2.0/gempak/include 
-I/home/gempak/GEMPAK6.2.0/os/linux64/include -g   gpnexr2.f 
/home/gempak/GEMPAK6.2.0/os/linux64/lib/gpnexr2.a 
/home/gempak/GEMPAK6.2.0/os/linux64/lib/gemlib.a 
/home/gempak/GEMPAK6.2.0/os/linux64/lib/cgemlib.a 
/home/gempak/GEMPAK6.2.0/os/linux64/lib/appl.a 
/home/gempak/GEMPAK6.2.0/os/linux64/lib/syslib.a 
/home/gempak/GEMPAK6.2.0/os/linux64/lib/gemlib.a 
/home/gempak/GEMPAK6.2.0/os/linux64/lib/libnetcdf.a 
/home/gempak/GEMPAK6.2.0/os/linux64/lib/textlib.a 
/home/gempak/GEMPAK6.2.0/os/linux64/lib/libxml2.a 
/home/gempak/GEMPAK6.2.0/os/linux64/lib/libxslt.a 
/home/gempak/GEMPAK6.2.0/os/linux64/lib/libz.a 
/home/gempak/GEMPAK6.2.0/os/linux64/lib/cgemlib.a 
/home/gempak/GEMPAK6.2.0/os/linux64/lib/rsl.a 
/home/gempak/GEMPAK6.2.0/os/linux64/lib/libbz2.a -lm  -o gpnexr2
/home/gempak/GEMPAK6.2.0/os/linux64/lib/gemlib.a(dbgradhdr.o): In function 
`db_gradhdr_':
/home/gempak/NAWIPS/gempak/source/gemlib/db/dbgradhdr.c:148: undefined 
reference to `xml_transform'
/home/gempak/GEMPAK6.2.0/os/linux64/lib/gemlib.a(dbgsathdr.o): In function 
`db_gsathdr_':
/home/gempak/NAWIPS/gempak/source/gemlib/db/dbgsathdr.c:130: undefined 
reference to `xml_transform'
/home/gempak/GEMPAK6.2.0/os/linux64/lib/gemlib.a(dbgfilenames.o): In function 
`db_gFileNames':
/home/gempak/NAWIPS/gempak/source/gemlib/db/dbgfilenames.c:175: undefined 
reference to `xml_transform'
/home/gempak/GEMPAK6.2.0/os/linux64/lib/gemlib.a(dbgnextcolumn.o): In function 
`db_gNextColumn':
/home/gempak/NAWIPS/gempak/source/gemlib/db/dbgnextcolumn.c:334: undefined 
reference to `xml_transform'
collect2: ld returned 1 exit status
make[3]: *** [gpnexr2] Error 1
make[3]: Leaving directory `/home/gempak/GEMPAK6.2.0/unidata/programs/gpnexr2'
making in /home/gempak/NAWIPS/unidata/programs/nexr2rhi
make[3]: Entering directory `/home/gempak/GEMPAK6.2.0/unidata/programs/nexr2rhi'
gfortran -fno-second-underscore -fno-range-check -fd-lines-as-comments 
-I/home/gempak/GEMPAK6.2.0/gempak/include 
-I/home/gempak/GEMPAK6.2.0/os/linux64/include -g   nexr2rhi.f 
/home/gempak/GEMPAK6.2.0/os/linux64/lib/nexr2rhi.a 
/home/gempak/GEMPAK6.2.0/os/linux64/lib/gemlib.a 
/home/gempak/GEMPAK6.2.0/os/linux64/lib/appl.a 
/home/gempak/GEMPAK6.2.0/os/linux64/lib/syslib.a 
/home/gempak/GEMPAK6.2.0/os/linux64/lib/cgemlib.a 
/home/gempak/GEMPAK6.2.0/os/linux64/lib/gemlib.a 
/home/gempak/GEMPAK6.2.0/os/linux64/lib/textlib.a 
/home/gempak/GEMPAK6.2.0/os/linux64/lib/libxml2.a 
/home/gempak/GEMPAK6.2.0/os/linux64/lib/libxslt.a 
/home/gempak/GEMPAK6.2.0/os/linux64/lib/libz.a 
/home/gempak/GEMPAK6.2.0/os/linux64/lib/cgemlib.a 
/home/gempak/GEMPAK6.2.0/os/linux64/lib/rsl.a 
/home/gempak/GEMPAK6.2.0/os/linux64/lib/libbz2.a  -lm -o nexr2rhi
/home/gempak/GEMPAK6.2.0/os/linux64/lib/gemlib.a(dbgfilenames.o): In function 
`db_gFileNames':
/home/gempak/NAWIPS/gempak/source/gemlib/db/dbgfilenames.c:175: undefined 
reference to `xml_transform'
/home/gempak/GEMPAK6.2.0/os/linux64/lib/gemlib.a(dbgnextcolumn.o): In function 
`db_gNextColumn':
/home/gempak/NAWIPS/gempak/source/gemlib/db/dbgnextcolumn.c:334: undefined 
reference to `xml_transform'
collect2: ld returned 1 exit status
make[3]: *** [nexr2rhi] Error 1
make[3]: Leaving directory `/home/gempak/GEMPAK6.2.0/unidata/programs/nexr2rhi'
making in /home/gempak/NAWIPS/unidata/programs/gpvad
make[3]: Entering directory `/home/gempak/GEMPAK6.2.0/unidata/programs/gpvad'
gfortran -fno-second-underscore -fno-range-check -fd-lines-as-comments 
-I/home/gempak/GEMPAK6.2.0/gempak/include 
-I/home/gempak/GEMPAK6.2.0/os/linux64/include -g   gpvad.f 
/home/gempak/GEMPAK6.2.0/os/linux64/lib/vad.a 
/home/gempak/GEMPAK6.2.0/os/linux64/lib/gemlib.a 
/home/gempak/GEMPAK6.2.0/os/linux64/lib/appl.a 
/home/gempak/GEMPAK6.2.0/os/linux64/lib/syslib.a 
/home/gempak/GEMPAK6.2.0/os/linux64/lib/cgemlib.a 
/home/gempak/GEMPAK6.2.0/os/linux64/lib/gemlib.a 
/home/gempak/GEMPAK6.2.0/os/linux64/lib/libnetcdf.a 
/home/gempak/GEMPAK6.2.0/os/linux64/lib/libpng.a 
/home/gempak/GEMPAK6.2.0/os/linux64/lib/textlib.a 
/home/gempak/GEMPAK6.2.0/os/linux64/lib/libxml2.a 
/home/gempak/GEMPAK6.2.0/os/linux64/lib/libxslt.a 
/home/gempak/GEMPAK6.2.0/os/linux64/lib/libz.a 
/home/gempak/GEMPAK6.2.0/os/linux64/lib/cgemlib.a 
/home/gempak/GEMPAK6.2.0/os/linux64/lib/rsl.a 
/home/gempak/GEMPAK6.2.0/os/linux64/lib/libbz2.a  -lm -o gpvad
/home/gempak/GEMPAK6.2.0/os/linux64/lib/gemlib.a(dbgradhdr.o): In function 
`db_gradhdr_':
/home/gempak/NAWIPS/gempak/source/gemlib/db/dbgradhdr.c:148: undefined 
reference to `xml_transform'
/home/gempak/GEMPAK6.2.0/os/linux64/lib/gemlib.a(dbgsathdr.o): In function 
`db_gsathdr_':
/home/gempak/NAWIPS/gempak/source/gemlib/db/dbgsathdr.c:130: undefined 
reference to `xml_transform'
/home/gempak/GEMPAK6.2.0/os/linux64/lib/gemlib.a(dbgfilenames.o): In function 
`db_gFileNames':
/home/gempak/NAWIPS/gempak/source/gemlib/db/dbgfilenames.c:175: undefined 
reference to `xml_transform'
/home/gempak/GEMPAK6.2.0/os/linux64/lib/gemlib.a(dbgnextcolumn.o): In function 
`db_gNextColumn':
/home/gempak/NAWIPS/gempak/source/gemlib/db/dbgnextcolumn.c:334: undefined 
reference to `xml_transform'
collect2: ld returned 1 exit status
make[3]: *** [gpvad] Error 1
make[3]: Leaving directory `/home/gempak/GEMPAK6.2.0/unidata/programs/gpvad'
making in /home/gempak/NAWIPS/unidata/programs/gpnids
make[3]: Entering directory `/home/gempak/GEMPAK6.2.0/unidata/programs/gpnids'
gfortran -fno-second-underscore -fno-range-check -fd-lines-as-comments 
-I/home/gempak/GEMPAK6.2.0/gempak/include 
-I/home/gempak/GEMPAK6.2.0/os/linux64/include -g   gpnids.f 
/home/gempak/GEMPAK6.2.0/os/linux64/lib/gpnids.a 
/home/gempak/GEMPAK6.2.0/os/linux64/lib/gemlib.a 
/home/gempak/GEMPAK6.2.0/os/linux64/lib/appl.a 
/home/gempak/GEMPAK6.2.0/os/linux64/lib/syslib.a 
/home/gempak/GEMPAK6.2.0/os/linux64/lib/cgemlib.a 
/home/gempak/GEMPAK6.2.0/os/linux64/lib/gemlib.a 
/home/gempak/GEMPAK6.2.0/os/linux64/lib/libnetcdf.a 
/home/gempak/GEMPAK6.2.0/os/linux64/lib/libpng.a 
/home/gempak/GEMPAK6.2.0/os/linux64/lib/textlib.a 
/home/gempak/GEMPAK6.2.0/os/linux64/lib/libxml2.a 
/home/gempak/GEMPAK6.2.0/os/linux64/lib/libxslt.a 
/home/gempak/GEMPAK6.2.0/os/linux64/lib/libz.a 
/home/gempak/GEMPAK6.2.0/os/linux64/lib/cgemlib.a 
/home/gempak/GEMPAK6.2.0/os/linux64/lib/rsl.a 
/home/gempak/GEMPAK6.2.0/os/linux64/lib/libbz2.a  -lm -o gpnids
/home/gempak/GEMPAK6.2.0/os/linux64/lib/gemlib.a(dbgradhdr.o): In function 
`db_gradhdr_':
/home/gempak/NAWIPS/gempak/source/gemlib/db/dbgradhdr.c:148: undefined 
reference to `xml_transform'
/home/gempak/GEMPAK6.2.0/os/linux64/lib/gemlib.a(dbgsathdr.o): In function 
`db_gsathdr_':
/home/gempak/NAWIPS/gempak/source/gemlib/db/dbgsathdr.c:130: undefined 
reference to `xml_transform'
/home/gempak/GEMPAK6.2.0/os/linux64/lib/gemlib.a(dbgfilenames.o): In function 
`db_gFileNames':
/home/gempak/NAWIPS/gempak/source/gemlib/db/dbgfilenames.c:175: undefined 
reference to `xml_transform'
/home/gempak/GEMPAK6.2.0/os/linux64/lib/gemlib.a(dbgnextcolumn.o): In function 
`db_gNextColumn':
/home/gempak/NAWIPS/gempak/source/gemlib/db/dbgnextcolumn.c:334: undefined 
reference to `xml_transform'
collect2: ld returned 1 exit status
make[3]: *** [gpnids] Error 1
make[3]: Leaving directory `/home/gempak/GEMPAK6.2.0/unidata/programs/gpnids'
making in /home/gempak/NAWIPS/unidata/programs/gdtopo
make[3]: Entering directory `/home/gempak/GEMPAK6.2.0/unidata/programs/gdtopo'
gfortran -fno-second-underscore -fno-range-check -fd-lines-as-comments 
-I/home/gempak/GEMPAK6.2.0/gempak/include 
-I/home/gempak/GEMPAK6.2.0/os/linux64/include -g   gdtopo.f 
/home/gempak/GEMPAK6.2.0/os/linux64/lib/gdtopo.a 
/home/gempak/GEMPAK6.2.0/os/linux64/lib/ginitp_alt.o 
/home/gempak/GEMPAK6.2.0/os/linux64/lib/gendp_alt.o 
/home/gempak/GEMPAK6.2.0/os/linux64/lib/gemlib.a 
/home/gempak/GEMPAK6.2.0/os/linux64/lib/gplt.a 
/home/gempak/GEMPAK6.2.0/os/linux64/lib/device.a 
/home/gempak/GEMPAK6.2.0/os/linux64/lib/gn.a 
/home/gempak/GEMPAK6.2.0/os/linux64/lib/cgemlib.a 
/home/gempak/GEMPAK6.2.0/os/linux64/lib/gemlib.a 
/home/gempak/GEMPAK6.2.0/os/linux64/lib/libpng.a 
/home/gempak/GEMPAK6.2.0/os/linux64/lib/libz.a -lm -o gdtopo
make[3]: Leaving directory `/home/gempak/GEMPAK6.2.0/unidata/programs/gdtopo'
making in /home/gempak/NAWIPS/unidata/programs/nmap_kiosk
make[3]: Entering directory 
`/home/gempak/GEMPAK6.2.0/unidata/programs/nmap_kiosk'
gcc -DUNDERSCORE -DLinux -I/home/gempak/GEMPAK6.2.0/gempak/include 
-I/home/gempak/GEMPAK6.2.0/os/linux64/include -I/usr/X11R6/include -DG_64BIT -g 
  -c nmap_kiosk.c
nmap_kiosk.c:44:34: fatal error: X11/extensions/XTest.h: No such file or 
directory
compilation terminated.
make[3]: *** [nmap_kiosk] Error 1
make[3]: Leaving directory 
`/home/gempak/GEMPAK6.2.0/unidata/programs/nmap_kiosk'
making in /home/gempak/NAWIPS/unidata/programs/gdcsv
make[3]: Entering directory `/home/gempak/GEMPAK6.2.0/unidata/programs/gdcsv'
gfortran -fno-second-underscore -fno-range-check -fd-lines-as-comments 
-I/home/gempak/GEMPAK6.2.0/gempak/include 
-I/home/gempak/GEMPAK6.2.0/os/linux64/include -g   \
        gdptin.o gdpttm.o gdcsv.o gdpout.o dgconav.o cwrapgcalc.o cwrapgcalcf.o 
\
        /home/gempak/GEMPAK6.2.0/os/linux64/lib/ginitp_alt.o 
/home/gempak/GEMPAK6.2.0/os/linux64/lib/gendp_alt.o 
/home/gempak/GEMPAK6.2.0/os/linux64/lib/gemlib.a 
/home/gempak/GEMPAK6.2.0/os/linux64/lib/gplt.a 
/home/gempak/GEMPAK6.2.0/os/linux64/lib/device.a 
/home/gempak/GEMPAK6.2.0/os/linux64/lib/gn.a 
/home/gempak/GEMPAK6.2.0/os/linux64/lib/cgemlib.a 
/home/gempak/GEMPAK6.2.0/os/linux64/lib/gemlib.a 
/home/gempak/GEMPAK6.2.0/os/linux64/lib/libnetcdf.a 
/home/gempak/GEMPAK6.2.0/os/linux64/lib/libjasper.a 
/home/gempak/GEMPAK6.2.0/os/linux64/lib/libpng.a 
/home/gempak/GEMPAK6.2.0/os/linux64/lib/textlib.a 
/home/gempak/GEMPAK6.2.0/os/linux64/lib/libxml2.a 
/home/gempak/GEMPAK6.2.0/os/linux64/lib/libxslt.a 
/home/gempak/GEMPAK6.2.0/os/linux64/lib/libz.a 
/home/gempak/GEMPAK6.2.0/os/linux64/lib/cgemlib.a 
/home/gempak/GEMPAK6.2.0/os/linux64/lib/rsl.a 
/home/gempak/GEMPAK6.2.0/os/linux64/lib/libbz2.a \
         \
        -o gdcsv
/home/gempak/GEMPAK6.2.0/os/linux64/lib/gemlib.a(dbgradhdr.o): In function 
`db_gradhdr_':
/home/gempak/NAWIPS/gempak/source/gemlib/db/dbgradhdr.c:148: undefined 
reference to `xml_transform'
/home/gempak/GEMPAK6.2.0/os/linux64/lib/gemlib.a(dbgsathdr.o): In function 
`db_gsathdr_':
/home/gempak/NAWIPS/gempak/source/gemlib/db/dbgsathdr.c:130: undefined 
reference to `xml_transform'
/home/gempak/GEMPAK6.2.0/os/linux64/lib/gemlib.a(dbgfilenames.o): In function 
`db_gFileNames':
/home/gempak/NAWIPS/gempak/source/gemlib/db/dbgfilenames.c:175: undefined 
reference to `xml_transform'
/home/gempak/GEMPAK6.2.0/os/linux64/lib/gemlib.a(dbgnextcolumn.o): In function 
`db_gNextColumn':
/home/gempak/NAWIPS/gempak/source/gemlib/db/dbgnextcolumn.c:334: undefined 
reference to `xml_transform'
collect2: ld returned 1 exit status
make[3]: *** [gdcsv] Error 1
make[3]: Leaving directory `/home/gempak/GEMPAK6.2.0/unidata/programs/gdcsv'
making in /home/gempak/NAWIPS/unidata/programs/sndiag
make[3]: Entering directory `/home/gempak/GEMPAK6.2.0/unidata/programs/sndiag'
make[3]: Nothing to be done for `all'.
make[3]: Leaving directory `/home/gempak/GEMPAK6.2.0/unidata/programs/sndiag'
making in /home/gempak/NAWIPS/unidata/programs/cwordsh
make[3]: Entering directory `/home/gempak/GEMPAK6.2.0/unidata/programs/cwordsh'
make[3]: Nothing to be done for `all'.
make[3]: Leaving directory `/home/gempak/GEMPAK6.2.0/unidata/programs/cwordsh'
making in /home/gempak/NAWIPS/unidata/programs/gd2img
make[3]: Entering directory `/home/gempak/GEMPAK6.2.0/unidata/programs/gd2img'
gfortran -fno-second-underscore -fno-range-check -fd-lines-as-comments 
-I/home/gempak/GEMPAK6.2.0/gempak/include 
-I/home/gempak/GEMPAK6.2.0/os/linux64/include -g   \
        gdptin.o gdpttm.o gdptup.o gd2img.o dgconav.o gdcnav.o gdcanl.o 
gdlgin.o writepng.o \
        /home/gempak/GEMPAK6.2.0/os/linux64/lib/ginitp_alt.o 
/home/gempak/GEMPAK6.2.0/os/linux64/lib/gendp_alt.o 
/home/gempak/GEMPAK6.2.0/os/linux64/lib/gemlib.a 
/home/gempak/GEMPAK6.2.0/os/linux64/lib/gplt.a 
/home/gempak/GEMPAK6.2.0/os/linux64/lib/device.a 
/home/gempak/GEMPAK6.2.0/os/linux64/lib/gn.a 
/home/gempak/GEMPAK6.2.0/os/linux64/lib/cgemlib.a 
/home/gempak/GEMPAK6.2.0/os/linux64/lib/gemlib.a 
/home/gempak/GEMPAK6.2.0/os/linux64/lib/libjasper.a 
/home/gempak/GEMPAK6.2.0/os/linux64/lib/libpng.a 
/home/gempak/GEMPAK6.2.0/os/linux64/lib/textlib.a 
/home/gempak/GEMPAK6.2.0/os/linux64/lib/libxml2.a 
/home/gempak/GEMPAK6.2.0/os/linux64/lib/libxslt.a 
/home/gempak/GEMPAK6.2.0/os/linux64/lib/libz.a 
/home/gempak/GEMPAK6.2.0/os/linux64/lib/cgemlib.a \
         \
        -o gd2img
/home/gempak/GEMPAK6.2.0/os/linux64/lib/gemlib.a(dbgfilenames.o): In function 
`db_gFileNames':
/home/gempak/NAWIPS/gempak/source/gemlib/db/dbgfilenames.c:175: undefined 
reference to `xml_transform'
/home/gempak/GEMPAK6.2.0/os/linux64/lib/gemlib.a(dbgnextcolumn.o): In function 
`db_gNextColumn':
/home/gempak/NAWIPS/gempak/source/gemlib/db/dbgnextcolumn.c:334: undefined 
reference to `xml_transform'
collect2: ld returned 1 exit status
make[3]: *** [gd2img] Error 1
make[3]: Leaving directory `/home/gempak/GEMPAK6.2.0/unidata/programs/gd2img'
making in /home/gempak/NAWIPS/unidata/programs/img2gd
make[3]: Entering directory `/home/gempak/GEMPAK6.2.0/unidata/programs/img2gd'
gfortran -fno-second-underscore -fno-range-check -fd-lines-as-comments 
-I/home/gempak/GEMPAK6.2.0/gempak/include 
-I/home/gempak/GEMPAK6.2.0/os/linux64/include -g   img2gd.f 
/home/gempak/GEMPAK6.2.0/os/linux64/lib/img2gd.a 
/home/gempak/GEMPAK6.2.0/os/linux64/lib/ginitp_alt.o 
/home/gempak/GEMPAK6.2.0/os/linux64/lib/gendp_alt.o 
/home/gempak/GEMPAK6.2.0/os/linux64/lib/gemlib.a 
/home/gempak/GEMPAK6.2.0/os/linux64/lib/gplt.a 
/home/gempak/GEMPAK6.2.0/os/linux64/lib/device.a 
/home/gempak/GEMPAK6.2.0/os/linux64/lib/gif.a 
/home/gempak/GEMPAK6.2.0/os/linux64/lib/gn.a 
/home/gempak/GEMPAK6.2.0/os/linux64/lib/gemlib.a 
/home/gempak/GEMPAK6.2.0/os/linux64/lib/cgemlib.a 
/home/gempak/GEMPAK6.2.0/os/linux64/lib/gemlib.a 
/home/gempak/GEMPAK6.2.0/os/linux64/lib/libnetcdf.a 
/home/gempak/GEMPAK6.2.0/os/linux64/lib/libpng.a 
/home/gempak/GEMPAK6.2.0/os/linux64/lib/textlib.a 
/home/gempak/GEMPAK6.2.0/os/linux64/lib/libxml2.a 
/home/gempak/GEMPAK6.2.0/os/linux64/lib/libxslt.a 
/home/gempak/GEMPAK6.2.0/os/linux64/lib/libz.a 
/home/gempak/GEMPAK6.2.0/os/linux64/lib/cgemlib.a 
/home/gempak/GEMPAK6.2.0/os/linux64/lib/rsl.a 
/home/gempak/GEMPAK6.2.0/os/linux64/lib/libbz2.a  -lm -o img2gd
/home/gempak/GEMPAK6.2.0/os/linux64/lib/gemlib.a(dbgradhdr.o): In function 
`db_gradhdr_':
/home/gempak/NAWIPS/gempak/source/gemlib/db/dbgradhdr.c:148: undefined 
reference to `xml_transform'
/home/gempak/GEMPAK6.2.0/os/linux64/lib/gemlib.a(dbgsathdr.o): In function 
`db_gsathdr_':
/home/gempak/NAWIPS/gempak/source/gemlib/db/dbgsathdr.c:130: undefined 
reference to `xml_transform'
/home/gempak/GEMPAK6.2.0/os/linux64/lib/gemlib.a(dbgfilenames.o): In function 
`db_gFileNames':
/home/gempak/NAWIPS/gempak/source/gemlib/db/dbgfilenames.c:175: undefined 
reference to `xml_transform'
/home/gempak/GEMPAK6.2.0/os/linux64/lib/gemlib.a(dbgnextcolumn.o): In function 
`db_gNextColumn':
/home/gempak/NAWIPS/gempak/source/gemlib/db/dbgnextcolumn.c:334: undefined 
reference to `xml_transform'
collect2: ld returned 1 exit status
make[3]: *** [img2gd] Error 1
make[3]: Leaving directory `/home/gempak/GEMPAK6.2.0/unidata/programs/img2gd'
make[2]: Leaving directory `/home/gempak/GEMPAK6.2.0/unidata/programs'
make[1]: Leaving directory `/home/gempak/GEMPAK6.2.0/unidata'
Making all in /home/gempak/NAWIPS/comet
make[1]: Entering directory `/home/gempak/GEMPAK6.2.0/comet'
making in /home/gempak/NAWIPS/comet/garp
make[2]: Entering directory `/home/gempak/GEMPAK6.2.0/comet/garp'
Make start time is Wed Mar 23 15:23:38 EDT 2011
Making all in /home/gempak/NAWIPS/comet/garp/init/linux64
make[3]: Entering directory `/home/gempak/GEMPAK6.2.0/comet/garp/init/linux64'
make[3]: Nothing to be done for `all'.
make[3]: Leaving directory `/home/gempak/GEMPAK6.2.0/comet/garp/init/linux64'
Making all in /home/gempak/NAWIPS/comet/garp/gui/linux64
make[3]: Entering directory `/home/gempak/GEMPAK6.2.0/comet/garp/gui/linux64'
make[3]: Nothing to be done for `all'.
make[3]: Leaving directory `/home/gempak/GEMPAK6.2.0/comet/garp/gui/linux64'
Making all in /home/gempak/NAWIPS/comet/garp/object/linux64
make[3]: Entering directory `/home/gempak/GEMPAK6.2.0/comet/garp/object/linux64'
make[3]: Nothing to be done for `all'.
make[3]: Leaving directory `/home/gempak/GEMPAK6.2.0/comet/garp/object/linux64'
Making all in /home/gempak/NAWIPS/comet/garp/util/linux64
make[3]: Entering directory `/home/gempak/GEMPAK6.2.0/comet/garp/util/linux64'
make[3]: Nothing to be done for `all'.
make[3]: Leaving directory `/home/gempak/GEMPAK6.2.0/comet/garp/util/linux64'
Making all in /home/gempak/NAWIPS/comet/garp/gempak/linux64
make[3]: Entering directory `/home/gempak/GEMPAK6.2.0/comet/garp/gempak/linux64'
make[3]: Leaving directory `/home/gempak/GEMPAK6.2.0/comet/garp/gempak/linux64'
Making all in /home/gempak/NAWIPS/comet/garp/xpm/linux64
make[3]: Entering directory `/home/gempak/GEMPAK6.2.0/comet/garp/xpm/linux64'
make[3]: Nothing to be done for `all'.
make[3]: Leaving directory `/home/gempak/GEMPAK6.2.0/comet/garp/xpm/linux64'
/home/gempak/GEMPAK6.2.0/os/linux64/lib/gemlib.a(dbgfilenames.o): In function 
`db_gFileNames':
/home/gempak/NAWIPS/gempak/source/gemlib/db/dbgfilenames.c:175: undefined 
reference to `xml_transform'
/home/gempak/GEMPAK6.2.0/os/linux64/lib/gemlib.a(dbgnextcolumn.o): In function 
`db_gNextColumn':
/home/gempak/NAWIPS/gempak/source/gemlib/db/dbgnextcolumn.c:334: undefined 
reference to `xml_transform'
/home/gempak/GEMPAK6.2.0/os/linux64/lib/gemlib.a(dbgradhdr.o): In function 
`db_gradhdr_':
/home/gempak/NAWIPS/gempak/source/gemlib/db/dbgradhdr.c:148: undefined 
reference to `xml_transform'
/home/gempak/GEMPAK6.2.0/os/linux64/lib/gemlib.a(dbgsathdr.o): In function 
`db_gsathdr_':
/home/gempak/NAWIPS/gempak/source/gemlib/db/dbgsathdr.c:130: undefined 
reference to `xml_transform'
collect2: ld returned 1 exit status
make[2]: *** [linux64/garp] Error 1
make[2]: Leaving directory `/home/gempak/GEMPAK6.2.0/comet/garp'
making in /home/gempak/NAWIPS/comet/etamap
make[2]: Entering directory `/home/gempak/GEMPAK6.2.0/comet/etamap'
gfortran -fno-second-underscore -fno-range-check -fd-lines-as-comments 
-I/home/gempak/GEMPAK6.2.0/gempak/include 
-I/home/gempak/GEMPAK6.2.0/os/linux64/include -g   etamap.f 
/home/gempak/GEMPAK6.2.0/os/linux64/lib/etamap.a 
/home/gempak/GEMPAK6.2.0/os/linux64/lib/gemlib.a 
/home/gempak/GEMPAK6.2.0/os/linux64/lib/cgemlib.a 
/home/gempak/GEMPAK6.2.0/os/linux64/lib/appl.a 
/home/gempak/GEMPAK6.2.0/os/linux64/lib/syslib.a 
/home/gempak/GEMPAK6.2.0/os/linux64/lib/gemlib.a 
/home/gempak/GEMPAK6.2.0/os/linux64/lib/libnetcdf.a 
/home/gempak/GEMPAK6.2.0/os/linux64/lib/textlib.a 
/home/gempak/GEMPAK6.2.0/os/linux64/lib/libxml2.a 
/home/gempak/GEMPAK6.2.0/os/linux64/lib/libxslt.a 
/home/gempak/GEMPAK6.2.0/os/linux64/lib/libz.a 
/home/gempak/GEMPAK6.2.0/os/linux64/lib/rsl.a 
/home/gempak/GEMPAK6.2.0/os/linux64/lib/libbz2.a  -lm -o etamap
/home/gempak/GEMPAK6.2.0/os/linux64/lib/gemlib.a(dbgradhdr.o): In function 
`db_gradhdr_':
/home/gempak/NAWIPS/gempak/source/gemlib/db/dbgradhdr.c:148: undefined 
reference to `xml_transform'
/home/gempak/GEMPAK6.2.0/os/linux64/lib/gemlib.a(dbgsathdr.o): In function 
`db_gsathdr_':
/home/gempak/NAWIPS/gempak/source/gemlib/db/dbgsathdr.c:130: undefined 
reference to `xml_transform'
collect2: ld returned 1 exit status
make[2]: *** [etamap] Error 1
make[2]: Leaving directory `/home/gempak/GEMPAK6.2.0/comet/etamap'
making in /home/gempak/NAWIPS/comet/gdpoint
make[2]: Entering directory `/home/gempak/GEMPAK6.2.0/comet/gdpoint'
gfortran -fno-second-underscore -fno-range-check -fd-lines-as-comments 
-I/home/gempak/GEMPAK6.2.0/gempak/include 
-I/home/gempak/GEMPAK6.2.0/os/linux64/include -g   \
        gdptin.o gdpttm.o gdptup.o gdpoint.o dgconav.o cwrapgcalc.o 
cwrapgcalcf.o \
        /home/gempak/GEMPAK6.2.0/os/linux64/lib/ginitp_alt.o 
/home/gempak/GEMPAK6.2.0/os/linux64/lib/gendp_alt.o 
/home/gempak/GEMPAK6.2.0/os/linux64/lib/gemlib.a 
/home/gempak/GEMPAK6.2.0/os/linux64/lib/gplt.a 
/home/gempak/GEMPAK6.2.0/os/linux64/lib/device.a 
/home/gempak/GEMPAK6.2.0/os/linux64/lib/gn.a 
/home/gempak/GEMPAK6.2.0/os/linux64/lib/cgemlib.a 
/home/gempak/GEMPAK6.2.0/os/linux64/lib/gemlib.a 
/home/gempak/GEMPAK6.2.0/os/linux64/lib/libjasper.a 
/home/gempak/GEMPAK6.2.0/os/linux64/lib/libpng.a 
/home/gempak/GEMPAK6.2.0/os/linux64/lib/textlib.a 
/home/gempak/GEMPAK6.2.0/os/linux64/lib/libxml2.a 
/home/gempak/GEMPAK6.2.0/os/linux64/lib/libxslt.a 
/home/gempak/GEMPAK6.2.0/os/linux64/lib/libz.a 
/home/gempak/GEMPAK6.2.0/os/linux64/lib/cgemlib.a \
         \
        -o gdpoint
/home/gempak/GEMPAK6.2.0/os/linux64/lib/gemlib.a(dbgfilenames.o): In function 
`db_gFileNames':
/home/gempak/NAWIPS/gempak/source/gemlib/db/dbgfilenames.c:175: undefined 
reference to `xml_transform'
/home/gempak/GEMPAK6.2.0/os/linux64/lib/gemlib.a(dbgnextcolumn.o): In function 
`db_gNextColumn':
/home/gempak/NAWIPS/gempak/source/gemlib/db/dbgnextcolumn.c:334: undefined 
reference to `xml_transform'
collect2: ld returned 1 exit status
make[2]: *** [gdpoint] Error 1
make[2]: Leaving directory `/home/gempak/GEMPAK6.2.0/comet/gdpoint'
making in /home/gempak/NAWIPS/comet/dcshef_comet
make[2]: Entering directory `/home/gempak/GEMPAK6.2.0/comet/dcshef_comet'
make[2]: Nothing to be done for `all'.
make[2]: Leaving directory `/home/gempak/GEMPAK6.2.0/comet/dcshef_comet'
make[1]: Leaving directory `/home/gempak/GEMPAK6.2.0/comet'

Thanks again!

Nathan Parker

WeatherBug Backyard Support