Re: [gembud] Installing GEMPAK on Fedora

Tried that, and it seemed to be building the make, but it also seems I've run 
into some issues. Here's what I've got so far:

make[2]: *** [/home/gempak/GEMPAK6.2.0/os/linux64/lib/ldmlog.a(ulog.o)] Error 
127
make[2]: Leaving directory `/home/gempak/GEMPAK6.2.0/unidata/ldmlog'
making in /home/gempak/NAWIPS/unidata/ldmbridge
make[2]: Entering directory `/home/gempak/GEMPAK6.2.0/unidata/ldmbridge'
making in /home/gempak/NAWIPS/unidata/ldmbridge/dcgrib
make[3]: Entering directory `/home/gempak/GEMPAK6.2.0/unidata/ldmbridge/dcgrib'
ln -s ../gribtonc_src/centers.h centers.h
ln -s ../gribtonc_src/emalloc.c emalloc.c
ln -s ../gribtonc_src/emalloc.h emalloc.h
ln -s ../gribtonc_src/gbds.h gbds.h
ln -s ../gribtonc_src/gbds.c gbds.c
ln -s ../gribtonc_src/gbytem.c gbytem.c
ln -s ../gribtonc_src/gbytem.h gbytem.h
ln -s ../gribtonc_src/gdes.h gdes.h
ln -s ../gribtonc_src/gdes.c gdes.c
ln -s ../gribtonc_src/gds.h gds.h
ln -s ../gribtonc_src/get_prod.c get_prod.c
ln -s ../gribtonc_src/get_prod.h get_prod.h
ln -s ../gribtonc_src/grib1.c grib1.c
ln -s ../gribtonc_src/grib1.h grib1.h
ln -s ../gribtonc_src/gribtypes.c gribtypes.c
ln -s ../gribtonc_src/gribtypes.h gribtypes.h
ln -s ../gribtonc_src/params.c params.c
ln -s ../gribtonc_src/params.h params.h
ln -s ../gribtonc_src/product_data.c product_data.c
ln -s ../gribtonc_src/product_data.h product_data.h
ln -s ../gribtonc_src/quasi.c quasi.c
ln -s ../gribtonc_src/quasi.h quasi.h
ln -s /home/gempak/GEMPAK6.2.0/gempak/source/griblib/na/nacmn.cmn .
ln -s /home/gempak/GEMPAK6.2.0/gempak/source/griblib/gb/gbcmn.h .
gcc -DUNDERSCORE -DLinux -I/home/gempak/GEMPAK6.2.0/gempak/include 
-I/home/gempak/GEMPAK6.2.0/os/linux64/include -I/usr/X11R6/include -DG_64BIT -g 
 -DGEMPAK -I/home/gempak/GEMPAK6.2.0/unidata/ldmlog -c -o dcgrib.o dcgrib.c
make[3]: gcc: Command not found
make[3]: *** [dcgrib.o] Error 127
make[3]: Leaving directory `/home/gempak/GEMPAK6.2.0/unidata/ldmbridge/dcgrib'
making in /home/gempak/NAWIPS/unidata/ldmbridge/dcacars
make[3]: Entering directory `/home/gempak/GEMPAK6.2.0/unidata/ldmbridge/dcacars'
gcc -DUNDERSCORE -DLinux -I/home/gempak/GEMPAK6.2.0/gempak/include 
-I/home/gempak/GEMPAK6.2.0/os/linux64/include -I/usr/X11R6/include -DG_64BIT -g 
 -DGEMPAK -I/home/gempak/GEMPAK6.2.0/os/linux64/include 
-I/home/gempak/GEMPAK6.2.0/unidata/ldmlog -c -o dcacars.o dcacars.c
make[3]: gcc: Command not found
make[3]: *** [dcacars.o] Error 127
make[3]: Leaving directory `/home/gempak/GEMPAK6.2.0/unidata/ldmbridge/dcacars'
making in /home/gempak/NAWIPS/unidata/ldmbridge/dcnldn
make[3]: Entering directory `/home/gempak/GEMPAK6.2.0/unidata/ldmbridge/dcnldn'
gcc -DUNDERSCORE -DLinux -I/home/gempak/GEMPAK6.2.0/gempak/include 
-I/home/gempak/GEMPAK6.2.0/os/linux64/include -I/usr/X11R6/include -DG_64BIT -g 
 -I/home/gempak/GEMPAK6.2.0/gempak/source/bridge/dc -c -o dcnldn.o dcnldn.c
make[3]: gcc: Command not found
make[3]: *** [dcnldn.o] Error 127
make[3]: Leaving directory `/home/gempak/GEMPAK6.2.0/unidata/ldmbridge/dcnldn'
making in /home/gempak/NAWIPS/unidata/ldmbridge/dcncprof
make[3]: Entering directory 
`/home/gempak/GEMPAK6.2.0/unidata/ldmbridge/dcncprof'
gcc -DUNDERSCORE -DLinux -I/home/gempak/GEMPAK6.2.0/gempak/include 
-I/home/gempak/GEMPAK6.2.0/os/linux64/include -I/usr/X11R6/include -DG_64BIT -g 
 -DGEMPAK -I/home/gempak/GEMPAK6.2.0/os/linux64/include 
-I/home/gempak/GEMPAK6.2.0/unidata/ldmlog -c -o dcncprof.o dcncprof.c
make[3]: gcc: Command not found
make[3]: *** [dcncprof.o] Error 127
make[3]: Leaving directory `/home/gempak/GEMPAK6.2.0/unidata/ldmbridge/dcncprof'
making in /home/gempak/NAWIPS/unidata/ldmbridge/dcwatch
make[3]: Entering directory `/home/gempak/GEMPAK6.2.0/unidata/ldmbridge/dcwatch'
gcc -DUNDERSCORE -DLinux -I/home/gempak/GEMPAK6.2.0/gempak/include 
-I/home/gempak/GEMPAK6.2.0/os/linux64/include -I/usr/X11R6/include -DG_64BIT -g 
 -I/home/gempak/GEMPAK6.2.0/unidata/ldmlog -c -o dcwatch.o dcwatch.c
make[3]: gcc: Command not found
make[3]: *** [dcwatch.o] Error 127
make[3]: Leaving directory `/home/gempak/GEMPAK6.2.0/unidata/ldmbridge/dcwatch'
making in /home/gempak/NAWIPS/unidata/ldmbridge/dctrop
make[3]: Entering directory `/home/gempak/GEMPAK6.2.0/unidata/ldmbridge/dctrop'
gcc -DUNDERSCORE -DLinux -I/home/gempak/GEMPAK6.2.0/gempak/include 
-I/home/gempak/GEMPAK6.2.0/os/linux64/include -I/usr/X11R6/include -DG_64BIT -g 
 -I/home/gempak/GEMPAK6.2.0/unidata/ldmlog -c -o dctrop.o dctrop.c
make[3]: gcc: Command not found
make[3]: *** [dctrop.o] Error 127
make[3]: Leaving directory `/home/gempak/GEMPAK6.2.0/unidata/ldmbridge/dctrop'
making in /home/gempak/NAWIPS/unidata/ldmbridge/dcstorm
make[3]: Entering directory `/home/gempak/GEMPAK6.2.0/unidata/ldmbridge/dcstorm'
gcc -DUNDERSCORE -DLinux -I/home/gempak/GEMPAK6.2.0/gempak/include 
-I/home/gempak/GEMPAK6.2.0/os/linux64/include -I/usr/X11R6/include -DG_64BIT -g 
  -c -o dcstorm.o dcstorm.c
make[3]: gcc: Command not found
make[3]: *** [dcstorm.o] Error 127
make[3]: Leaving directory `/home/gempak/GEMPAK6.2.0/unidata/ldmbridge/dcstorm'
making in /home/gempak/NAWIPS/unidata/ldmbridge/dcgrib2
make[3]: Entering directory `/home/gempak/GEMPAK6.2.0/unidata/ldmbridge/dcgrib2'
gcc -DUNDERSCORE -DLinux -I/home/gempak/GEMPAK6.2.0/gempak/include 
-I/home/gempak/GEMPAK6.2.0/os/linux64/include -I/usr/X11R6/include -DG_64BIT -g 
 -I/home/gempak/GEMPAK6.2.0/gempak/source/griblib/gb 
-I/home/gempak/GEMPAK6.2.0/gempak/source/bridge/dc 
-I/home/gempak/GEMPAK6.2.0/gempak/source/griblib/na -c -o dcchecksub.o 
dcchecksub.c
make[3]: gcc: Command not found
make[3]: *** [dcchecksub.o] Error 127
make[3]: Leaving directory `/home/gempak/GEMPAK6.2.0/unidata/ldmbridge/dcgrib2'
making in /home/gempak/NAWIPS/unidata/ldmbridge/dcsuomi
make[3]: Entering directory `/home/gempak/GEMPAK6.2.0/unidata/ldmbridge/dcsuomi'
gcc -DUNDERSCORE -DLinux -I/home/gempak/GEMPAK6.2.0/gempak/include 
-I/home/gempak/GEMPAK6.2.0/os/linux64/include -I/usr/X11R6/include -DG_64BIT -g 
 -DGEMPAK -I/home/gempak/GEMPAK6.2.0/os/linux64/include 
-I/home/gempak/GEMPAK6.2.0/unidata/ldmlog -c -o dcsuomi.o dcsuomi.c
make[3]: gcc: Command not found
make[3]: *** [dcsuomi.o] Error 127
make[3]: Leaving directory `/home/gempak/GEMPAK6.2.0/unidata/ldmbridge/dcsuomi'
making in /home/gempak/NAWIPS/unidata/ldmbridge/dcprof
make[3]: Entering directory `/home/gempak/GEMPAK6.2.0/unidata/ldmbridge/dcprof'
gcc -DUNDERSCORE -DLinux -I/home/gempak/GEMPAK6.2.0/gempak/include 
-I/home/gempak/GEMPAK6.2.0/os/linux64/include -I/usr/X11R6/include -DG_64BIT -g 
 -I/home/gempak/GEMPAK6.2.0/gempak/source/bridge/dc 
-I/home/gempak/GEMPAK6.2.0/unidata/ldmlog -c -o dcprof.o dcprof.c
make[3]: gcc: Command not found
make[3]: *** [dcprof.o] Error 127
make[3]: Leaving directory `/home/gempak/GEMPAK6.2.0/unidata/ldmbridge/dcprof'
making in /home/gempak/NAWIPS/unidata/ldmbridge/dcnexr2
make[3]: Entering directory `/home/gempak/GEMPAK6.2.0/unidata/ldmbridge/dcnexr2'
gcc -DUNDERSCORE -DLinux -I/home/gempak/GEMPAK6.2.0/gempak/include 
-I/home/gempak/GEMPAK6.2.0/os/linux64/include -I/usr/X11R6/include -DG_64BIT -g 
 -I/home/gempak/GEMPAK6.2.0/gempak/source/bzip2 
-I/home/gempak/GEMPAK6.2.0/gempak/source/bridge/dc -c -o dcnexr2.o dcnexr2.c
make[3]: gcc: Command not found
make[3]: *** [dcnexr2.o] Error 127
make[3]: Leaving directory `/home/gempak/GEMPAK6.2.0/unidata/ldmbridge/dcnexr2'
making in /home/gempak/NAWIPS/unidata/ldmbridge/dcuspln
make[3]: Entering directory `/home/gempak/GEMPAK6.2.0/unidata/ldmbridge/dcuspln'
gcc -DUNDERSCORE -DLinux -I/home/gempak/GEMPAK6.2.0/gempak/include 
-I/home/gempak/GEMPAK6.2.0/os/linux64/include -I/usr/X11R6/include -DG_64BIT -g 
 -I/home/gempak/GEMPAK6.2.0/gempak/source/bridge/dc -c -o dcuspln.o dcuspln.c
make[3]: gcc: Command not found
make[3]: *** [dcuspln.o] Error 127
make[3]: Leaving directory `/home/gempak/GEMPAK6.2.0/unidata/ldmbridge/dcuspln'
making in /home/gempak/NAWIPS/unidata/ldmbridge/dccosmic
make[3]: Entering directory 
`/home/gempak/GEMPAK6.2.0/unidata/ldmbridge/dccosmic'
gcc -DUNDERSCORE -DLinux -I/home/gempak/GEMPAK6.2.0/gempak/include 
-I/home/gempak/GEMPAK6.2.0/os/linux64/include -I/usr/X11R6/include -DG_64BIT -g 
 -DGEMPAK -I/home/gempak/GEMPAK6.2.0/os/linux64/include 
-I/home/gempak/GEMPAK6.2.0/unidata/ldmlog -c -o dccosmic.o dccosmic.c
make[3]: gcc: Command not found
make[3]: *** [dccosmic.o] Error 127
make[3]: Leaving directory `/home/gempak/GEMPAK6.2.0/unidata/ldmbridge/dccosmic'
making in /home/gempak/NAWIPS/unidata/ldmbridge/dcreanal
make[3]: Entering directory 
`/home/gempak/GEMPAK6.2.0/unidata/ldmbridge/dcreanal'
gcc -DUNDERSCORE -DLinux -I/home/gempak/GEMPAK6.2.0/gempak/include 
-I/home/gempak/GEMPAK6.2.0/os/linux64/include -I/usr/X11R6/include -DG_64BIT -g 
 -I/home/gempak/GEMPAK6.2.0/unidata/ldmlog 
-I/home/gempak/GEMPAK6.2.0/os/linux64/include -c -o dcreanal.o dcreanal.c
make[3]: gcc: Command not found
make[3]: *** [dcreanal.o] Error 127
make[3]: Leaving directory `/home/gempak/GEMPAK6.2.0/unidata/ldmbridge/dcreanal'
making in /home/gempak/NAWIPS/unidata/ldmbridge/dcreanal2
make[3]: Entering directory 
`/home/gempak/GEMPAK6.2.0/unidata/ldmbridge/dcreanal2'
gcc -DUNDERSCORE -DLinux -I/home/gempak/GEMPAK6.2.0/gempak/include 
-I/home/gempak/GEMPAK6.2.0/os/linux64/include -I/usr/X11R6/include -DG_64BIT -g 
 -I/home/gempak/GEMPAK6.2.0/os/linux64/include 
-I/home/gempak/GEMPAK6.2.0/gempak/source/griblib/na -c -o dcreanal.o dcreanal.c
make[3]: gcc: Command not found
make[3]: *** [dcreanal.o] Error 127
make[3]: Leaving directory 
`/home/gempak/GEMPAK6.2.0/unidata/ldmbridge/dcreanal2'
making in /home/gempak/NAWIPS/unidata/ldmbridge/dcredbook
make[3]: Entering directory 
`/home/gempak/GEMPAK6.2.0/unidata/ldmbridge/dcredbook'
gfortran -fno-second-underscore -fno-range-check -fd-lines-as-comments 
-I/home/gempak/GEMPAK6.2.0/gempak/include 
-I/home/gempak/GEMPAK6.2.0/os/linux64/include -g  
-I/home/gempak/GEMPAK6.2.0/gempak/source/bridge/dc 
-I/home/gempak/GEMPAK6.2.0/gempak/source/gemlib/ip -c -o ipredbook.o ipredbook.f
make[3]: gfortran: Command not found
make[3]: *** [ipredbook.o] Error 127
make[3]: Leaving directory 
`/home/gempak/GEMPAK6.2.0/unidata/ldmbridge/dcredbook'
making in /home/gempak/NAWIPS/unidata/ldmbridge/dcwmostrip
make[3]: Entering directory 
`/home/gempak/GEMPAK6.2.0/unidata/ldmbridge/dcwmostrip'
make[3]: *** No rule to make target 
`/home/gempak/GEMPAK6.2.0/os/linux64/lib/bridge.a', needed by `dcwmostrip'.  
Stop.
make[3]: Leaving directory 
`/home/gempak/GEMPAK6.2.0/unidata/ldmbridge/dcwmostrip'
make[2]: Leaving directory `/home/gempak/GEMPAK6.2.0/unidata/ldmbridge'
making in /home/gempak/NAWIPS/unidata/programs
make[2]: Entering directory `/home/gempak/GEMPAK6.2.0/unidata/programs'
making in /home/gempak/NAWIPS/unidata/programs/gpfront
make[3]: Entering directory `/home/gempak/GEMPAK6.2.0/unidata/programs/gpfront'
gfortran -fno-second-underscore -fno-range-check -fd-lines-as-comments 
-I/home/gempak/GEMPAK6.2.0/gempak/include 
-I/home/gempak/GEMPAK6.2.0/os/linux64/include -g  -c gpinp.f
make[3]: gfortran: Command not found
make[3]: *** [/home/gempak/GEMPAK6.2.0/os/linux64/lib/gpfront.a(gpinp.o)] Error 
127
make[3]: Leaving directory `/home/gempak/GEMPAK6.2.0/unidata/programs/gpfront'
making in /home/gempak/NAWIPS/unidata/programs/gprcm
make[3]: Entering directory `/home/gempak/GEMPAK6.2.0/unidata/programs/gprcm'
gfortran -fno-second-underscore -fno-range-check -fd-lines-as-comments 
-I/home/gempak/GEMPAK6.2.0/gempak/include 
-I/home/gempak/GEMPAK6.2.0/os/linux64/include -g  -c gpinp.f
make[3]: gfortran: Command not found
make[3]: *** [/home/gempak/GEMPAK6.2.0/os/linux64/lib/gprcm.a(gpinp.o)] Error 
127
make[3]: Leaving directory `/home/gempak/GEMPAK6.2.0/unidata/programs/gprcm'
making in /home/gempak/NAWIPS/unidata/programs/fips
make[3]: Entering directory `/home/gempak/GEMPAK6.2.0/unidata/programs/fips'
make[3]: *** No rule to make target 
`/home/gempak/GEMPAK6.2.0/os/linux64/lib/gemlib.a', needed by `fips'.  Stop.
make[3]: Leaving directory `/home/gempak/GEMPAK6.2.0/unidata/programs/fips'
making in /home/gempak/NAWIPS/unidata/programs/areainfo
make[3]: Entering directory `/home/gempak/GEMPAK6.2.0/unidata/programs/areainfo'
gcc -DUNDERSCORE -DLinux -I/home/gempak/GEMPAK6.2.0/gempak/include 
-I/home/gempak/GEMPAK6.2.0/os/linux64/include -I/usr/X11R6/include -DG_64BIT -g 
  -c -o filename.o filename.c
make[3]: gcc: Command not found
make[3]: *** [filename.o] Error 127
make[3]: Leaving directory `/home/gempak/GEMPAK6.2.0/unidata/programs/areainfo'
making in /home/gempak/NAWIPS/unidata/programs/gpwarn
make[3]: Entering directory `/home/gempak/GEMPAK6.2.0/unidata/programs/gpwarn'
gfortran -fno-second-underscore -fno-range-check -fd-lines-as-comments 
-I/home/gempak/GEMPAK6.2.0/gempak/include 
-I/home/gempak/GEMPAK6.2.0/os/linux64/include -g  -c ggsls.f
make[3]: gfortran: Command not found
make[3]: *** [/home/gempak/GEMPAK6.2.0/os/linux64/lib/gpwarn.a(ggsls.o)] Error 
127
make[3]: Leaving directory `/home/gempak/GEMPAK6.2.0/unidata/programs/gpwarn'
making in /home/gempak/NAWIPS/unidata/programs/sfctime
make[3]: Entering directory `/home/gempak/GEMPAK6.2.0/unidata/programs/sfctime'
gcc -DUNDERSCORE -DLinux -I/home/gempak/GEMPAK6.2.0/gempak/include 
-I/home/gempak/GEMPAK6.2.0/os/linux64/include -I/usr/X11R6/include -DG_64BIT -g 
  -c sfctime.c
make[3]: gcc: Command not found
make[3]: *** [sfctime.o] Error 127
make[3]: Leaving directory `/home/gempak/GEMPAK6.2.0/unidata/programs/sfctime'
making in /home/gempak/NAWIPS/unidata/programs/gdbiint
make[3]: Entering directory `/home/gempak/GEMPAK6.2.0/unidata/programs/gdbiint'
gfortran -fno-second-underscore -fno-range-check -fd-lines-as-comments 
-I/home/gempak/GEMPAK6.2.0/gempak/include 
-I/home/gempak/GEMPAK6.2.0/os/linux64/include -g  -c gdinterp.f
make[3]: gfortran: Command not found
make[3]: *** [/home/gempak/GEMPAK6.2.0/os/linux64/lib/gdbiint.a(gdinterp.o)] 
Error 127
make[3]: Leaving directory `/home/gempak/GEMPAK6.2.0/unidata/programs/gdbiint'
making in /home/gempak/NAWIPS/unidata/programs/acprof
make[3]: Entering directory `/home/gempak/GEMPAK6.2.0/unidata/programs/acprof'
gfortran -fno-second-underscore -fno-range-check -fd-lines-as-comments 
-I/home/gempak/GEMPAK6.2.0/gempak/include 
-I/home/gempak/GEMPAK6.2.0/os/linux64/include -g  -c mknam.f
make[3]: gfortran: Command not found
make[3]: *** [/home/gempak/GEMPAK6.2.0/os/linux64/lib/acprof.a(mknam.o)] Error 
127
make[3]: Leaving directory `/home/gempak/GEMPAK6.2.0/unidata/programs/acprof'
making in /home/gempak/NAWIPS/unidata/programs/trajectory
make[3]: Entering directory 
`/home/gempak/GEMPAK6.2.0/unidata/programs/trajectory'
gfortran -fno-second-underscore -fno-range-check -fd-lines-as-comments 
-I/home/gempak/GEMPAK6.2.0/gempak/include 
-I/home/gempak/GEMPAK6.2.0/os/linux64/include -g  -c ggtraj.f
make[3]: gfortran: Command not found
make[3]: *** [/home/gempak/GEMPAK6.2.0/os/linux64/lib/gptraj.a(ggtraj.o)] Error 
127
make[3]: Leaving directory 
`/home/gempak/GEMPAK6.2.0/unidata/programs/trajectory'
making in /home/gempak/NAWIPS/unidata/programs/gdradr
make[3]: Entering directory `/home/gempak/GEMPAK6.2.0/unidata/programs/gdradr'
gfortran -fno-second-underscore -fno-range-check -fd-lines-as-comments 
-I/home/gempak/GEMPAK6.2.0/gempak/include 
-I/home/gempak/GEMPAK6.2.0/os/linux64/include -g  -c gpinp.f
make[3]: gfortran: Command not found
make[3]: *** [/home/gempak/GEMPAK6.2.0/os/linux64/lib/gdradr.a(gpinp.o)] Error 
127
make[3]: Leaving directory `/home/gempak/GEMPAK6.2.0/unidata/programs/gdradr'
making in /home/gempak/NAWIPS/unidata/programs/gdradrc
make[3]: Entering directory `/home/gempak/GEMPAK6.2.0/unidata/programs/gdradrc'
gfortran -fno-second-underscore -fno-range-check -fd-lines-as-comments 
-I/home/gempak/GEMPAK6.2.0/gempak/include 
-I/home/gempak/GEMPAK6.2.0/os/linux64/include -g  -c gpinp.f
make[3]: gfortran: Command not found
make[3]: *** [/home/gempak/GEMPAK6.2.0/os/linux64/lib/gdradrc.a(gpinp.o)] Error 
127
make[3]: Leaving directory `/home/gempak/GEMPAK6.2.0/unidata/programs/gdradrc'
making in /home/gempak/NAWIPS/unidata/programs/nex2gini
make[3]: Entering directory `/home/gempak/GEMPAK6.2.0/unidata/programs/nex2gini'
gfortran -fno-second-underscore -fno-range-check -fd-lines-as-comments 
-I/home/gempak/GEMPAK6.2.0/gempak/include 
-I/home/gempak/GEMPAK6.2.0/os/linux64/include -g  -c gpinp.f
make[3]: gfortran: Command not found
make[3]: *** [/home/gempak/GEMPAK6.2.0/os/linux64/lib/nex2gini.a(gpinp.o)] 
Error 127
make[3]: Leaving directory `/home/gempak/GEMPAK6.2.0/unidata/programs/nex2gini'
making in /home/gempak/NAWIPS/unidata/programs/nex2img
make[3]: Entering directory `/home/gempak/GEMPAK6.2.0/unidata/programs/nex2img'
gfortran -fno-second-underscore -fno-range-check -fd-lines-as-comments 
-I/home/gempak/GEMPAK6.2.0/gempak/include 
-I/home/gempak/GEMPAK6.2.0/os/linux64/include -g  -c gpinp.f
make[3]: gfortran: Command not found
make[3]: *** [/home/gempak/GEMPAK6.2.0/os/linux64/lib/nex2img.a(gpinp.o)] Error 
127
make[3]: Leaving directory `/home/gempak/GEMPAK6.2.0/unidata/programs/nex2img'
making in /home/gempak/NAWIPS/unidata/programs/gdobscnt
make[3]: Entering directory `/home/gempak/GEMPAK6.2.0/unidata/programs/gdobscnt'
gfortran -fno-second-underscore -fno-range-check -fd-lines-as-comments 
-I/home/gempak/GEMPAK6.2.0/gempak/include 
-I/home/gempak/GEMPAK6.2.0/os/linux64/include -g  -c gpinp.f
make[3]: gfortran: Command not found
make[3]: *** [/home/gempak/GEMPAK6.2.0/os/linux64/lib/gdobscnt.a(gpinp.o)] 
Error 127
make[3]: Leaving directory `/home/gempak/GEMPAK6.2.0/unidata/programs/gdobscnt'
making in /home/gempak/NAWIPS/unidata/programs/gpnexr2
make[3]: Entering directory `/home/gempak/GEMPAK6.2.0/unidata/programs/gpnexr2'
gfortran -fno-second-underscore -fno-range-check -fd-lines-as-comments 
-I/home/gempak/GEMPAK6.2.0/gempak/include 
-I/home/gempak/GEMPAK6.2.0/os/linux64/include -g  -c gpminp.f
make[3]: gfortran: Command not found
make[3]: *** [/home/gempak/GEMPAK6.2.0/os/linux64/lib/gpnexr2.a(gpminp.o)] 
Error 127
make[3]: Leaving directory `/home/gempak/GEMPAK6.2.0/unidata/programs/gpnexr2'
making in /home/gempak/NAWIPS/unidata/programs/nexr2rhi
make[3]: Entering directory `/home/gempak/GEMPAK6.2.0/unidata/programs/nexr2rhi'
gfortran -fno-second-underscore -fno-range-check -fd-lines-as-comments 
-I/home/gempak/GEMPAK6.2.0/gempak/include 
-I/home/gempak/GEMPAK6.2.0/os/linux64/include -g  -c gdxdsp.f
make[3]: gfortran: Command not found
make[3]: *** [/home/gempak/GEMPAK6.2.0/os/linux64/lib/nexr2rhi.a(gdxdsp.o)] 
Error 127
make[3]: Leaving directory `/home/gempak/GEMPAK6.2.0/unidata/programs/nexr2rhi'
making in /home/gempak/NAWIPS/unidata/programs/gpvad
make[3]: Entering directory `/home/gempak/GEMPAK6.2.0/unidata/programs/gpvad'
gfortran -fno-second-underscore -fno-range-check -fd-lines-as-comments 
-I/home/gempak/GEMPAK6.2.0/gempak/include 
-I/home/gempak/GEMPAK6.2.0/os/linux64/include -g  -c gpvinp.f
make[3]: gfortran: Command not found
make[3]: *** [/home/gempak/GEMPAK6.2.0/os/linux64/lib/vad.a(gpvinp.o)] Error 127
make[3]: Leaving directory `/home/gempak/GEMPAK6.2.0/unidata/programs/gpvad'
making in /home/gempak/NAWIPS/unidata/programs/gpnids
make[3]: Entering directory `/home/gempak/GEMPAK6.2.0/unidata/programs/gpnids'
gfortran -fno-second-underscore -fno-range-check -fd-lines-as-comments 
-I/home/gempak/GEMPAK6.2.0/gempak/include 
-I/home/gempak/GEMPAK6.2.0/os/linux64/include -g  -c gplutf.f
make[3]: gfortran: Command not found
make[3]: *** [/home/gempak/GEMPAK6.2.0/os/linux64/lib/gpnids.a(gplutf.o)] Error 
127
make[3]: Leaving directory `/home/gempak/GEMPAK6.2.0/unidata/programs/gpnids'
making in /home/gempak/NAWIPS/unidata/programs/gdtopo
make[3]: Entering directory `/home/gempak/GEMPAK6.2.0/unidata/programs/gdtopo'
gfortran -fno-second-underscore -fno-range-check -fd-lines-as-comments 
-I/home/gempak/GEMPAK6.2.0/gempak/include 
-I/home/gempak/GEMPAK6.2.0/os/linux64/include -g  -c gdtdsp.f
make[3]: gfortran: Command not found
make[3]: *** [/home/gempak/GEMPAK6.2.0/os/linux64/lib/gdtopo.a(gdtdsp.o)] Error 
127
make[3]: Leaving directory `/home/gempak/GEMPAK6.2.0/unidata/programs/gdtopo'
making in /home/gempak/NAWIPS/unidata/programs/nmap_kiosk
make[3]: Entering directory 
`/home/gempak/GEMPAK6.2.0/unidata/programs/nmap_kiosk'
gcc -DUNDERSCORE -DLinux -I/home/gempak/GEMPAK6.2.0/gempak/include 
-I/home/gempak/GEMPAK6.2.0/os/linux64/include -I/usr/X11R6/include -DG_64BIT -g 
  -c nmap_kiosk.c
make[3]: gcc: Command not found
make[3]: *** [nmap_kiosk] Error 127
make[3]: Leaving directory 
`/home/gempak/GEMPAK6.2.0/unidata/programs/nmap_kiosk'
making in /home/gempak/NAWIPS/unidata/programs/gdcsv
make[3]: Entering directory `/home/gempak/GEMPAK6.2.0/unidata/programs/gdcsv'
make[3]: *** No rule to make target 
`/home/gempak/GEMPAK6.2.0/os/linux64/lib/ginitp_alt.o', needed by `all'.  Stop.
make[3]: Leaving directory `/home/gempak/GEMPAK6.2.0/unidata/programs/gdcsv'
making in /home/gempak/NAWIPS/unidata/programs/sndiag
make[3]: Entering directory `/home/gempak/GEMPAK6.2.0/unidata/programs/sndiag'
gfortran -fno-second-underscore -fno-range-check -fd-lines-as-comments 
-I/home/gempak/GEMPAK6.2.0/gempak/include 
-I/home/gempak/GEMPAK6.2.0/os/linux64/include -g  -c sndarr.f
make[3]: gfortran: Command not found
make[3]: *** [/home/gempak/GEMPAK6.2.0/os/linux64/lib/sndiag.a(sndarr.o)] Error 
127
make[3]: Leaving directory `/home/gempak/GEMPAK6.2.0/unidata/programs/sndiag'
making in /home/gempak/NAWIPS/unidata/programs/cwordsh
make[3]: Entering directory `/home/gempak/GEMPAK6.2.0/unidata/programs/cwordsh'
gfortran -fno-second-underscore -fno-range-check -fd-lines-as-comments 
-I/home/gempak/GEMPAK6.2.0/gempak/include 
-I/home/gempak/GEMPAK6.2.0/os/linux64/include -g   -o cwordsh cwordsh.f 
-L/home/gempak/GEMPAK6.2.0/os/linux64/lib -lncepBUFR
make[3]: gfortran: Command not found
make[3]: *** [cwordsh] Error 127
make[3]: Leaving directory `/home/gempak/GEMPAK6.2.0/unidata/programs/cwordsh'
making in /home/gempak/NAWIPS/unidata/programs/gd2img
make[3]: Entering directory `/home/gempak/GEMPAK6.2.0/unidata/programs/gd2img'
make[3]: *** No rule to make target 
`/home/gempak/GEMPAK6.2.0/os/linux64/lib/ginitp_alt.o', needed by `all'.  Stop.
make[3]: Leaving directory `/home/gempak/GEMPAK6.2.0/unidata/programs/gd2img'
making in /home/gempak/NAWIPS/unidata/programs/img2gd
make[3]: Entering directory `/home/gempak/GEMPAK6.2.0/unidata/programs/img2gd'
gfortran -fno-second-underscore -fno-range-check -fd-lines-as-comments 
-I/home/gempak/GEMPAK6.2.0/gempak/include 
-I/home/gempak/GEMPAK6.2.0/os/linux64/include -g  -c gpinp.f
make[3]: gfortran: Command not found
make[3]: *** [/home/gempak/GEMPAK6.2.0/os/linux64/lib/img2gd.a(gpinp.o)] Error 
127
make[3]: Leaving directory `/home/gempak/GEMPAK6.2.0/unidata/programs/img2gd'
make[2]: Leaving directory `/home/gempak/GEMPAK6.2.0/unidata/programs'
make[1]: Leaving directory `/home/gempak/GEMPAK6.2.0/unidata'
Making all in /home/gempak/NAWIPS/comet
make[1]: Entering directory `/home/gempak/GEMPAK6.2.0/comet'
making in /home/gempak/NAWIPS/comet/garp
make[2]: Entering directory `/home/gempak/GEMPAK6.2.0/comet/garp'
Make start time is Sun Feb 20 19:30:30 EST 2011
Making all in /home/gempak/NAWIPS/comet/garp/init/linux64
make[3]: Entering directory `/home/gempak/GEMPAK6.2.0/comet/garp/init/linux64'
gcc -DUNDERSCORE -DLinux -I/home/gempak/GEMPAK6.2.0/gempak/include 
-I/home/gempak/GEMPAK6.2.0/os/linux64/include -I/usr/X11R6/include -DG_64BIT -g 
  -c ../init_actions.c \
         \
        -I/usr/X11R6/include \
        -I/home/gempak/GEMPAK6.2.0/comet/garp/include \
        -I/home/gempak/GEMPAK6.2.0/gempak/include 
-I/home/gempak/GEMPAK6.2.0/os/linux64/include \
        -I/home/gempak/GEMPAK6.2.0/comet/garp/xpm
make[3]: gcc: Command not found
make[3]: *** [init_actions.o] Error 127
make[3]: Leaving directory `/home/gempak/GEMPAK6.2.0/comet/garp/init/linux64'
Making all in /home/gempak/NAWIPS/comet/garp/gui/linux64
make[3]: Entering directory `/home/gempak/GEMPAK6.2.0/comet/garp/gui/linux64'
gcc -DUNDERSCORE -DLinux -I/home/gempak/GEMPAK6.2.0/gempak/include 
-I/home/gempak/GEMPAK6.2.0/os/linux64/include -I/usr/X11R6/include -DG_64BIT -g 
  -c ../animcontrol.c \
         \
        -I/usr/X11R6/include \
        -I/home/gempak/GEMPAK6.2.0/comet/garp/include \
        -I/home/gempak/GEMPAK6.2.0/gempak/include 
-I/home/gempak/GEMPAK6.2.0/os/linux64/include \
        -I/home/gempak/GEMPAK6.2.0/comet/garp/xpm
make[3]: gcc: Command not found
make[3]: *** [animcontrol.o] Error 127
make[3]: Leaving directory `/home/gempak/GEMPAK6.2.0/comet/garp/gui/linux64'
Making all in /home/gempak/NAWIPS/comet/garp/object/linux64
make[3]: Entering directory `/home/gempak/GEMPAK6.2.0/comet/garp/object/linux64'
gcc -DUNDERSCORE -DLinux -I/home/gempak/GEMPAK6.2.0/gempak/include 
-I/home/gempak/GEMPAK6.2.0/os/linux64/include -I/usr/X11R6/include -DG_64BIT -g 
  -c ../animobj.c \
         \
        -I/usr/X11R6/include \
        -I/home/gempak/GEMPAK6.2.0/comet/garp/include \
        -I/home/gempak/GEMPAK6.2.0/gempak/include 
-I/home/gempak/GEMPAK6.2.0/os/linux64/include \
        -I/home/gempak/GEMPAK6.2.0/comet/garp/xpm
make[3]: gcc: Command not found
make[3]: *** [animobj.o] Error 127
make[3]: Leaving directory `/home/gempak/GEMPAK6.2.0/comet/garp/object/linux64'
Making all in /home/gempak/NAWIPS/comet/garp/util/linux64
make[3]: Entering directory `/home/gempak/GEMPAK6.2.0/comet/garp/util/linux64'
gcc -DUNDERSCORE -DLinux -I/home/gempak/GEMPAK6.2.0/gempak/include 
-I/home/gempak/GEMPAK6.2.0/os/linux64/include -I/usr/X11R6/include -DG_64BIT -g 
  -c ../abortproc.c \
         \
        -I/usr/X11R6/include \
        -I/home/gempak/GEMPAK6.2.0/comet/garp/include \
        -I/home/gempak/GEMPAK6.2.0/gempak/include 
-I/home/gempak/GEMPAK6.2.0/os/linux64/include \
        -I/home/gempak/GEMPAK6.2.0/comet/garp/xpm
make[3]: gcc: Command not found
make[3]: *** [abortproc.o] Error 127
make[3]: Leaving directory `/home/gempak/GEMPAK6.2.0/comet/garp/util/linux64'
Making all in /home/gempak/NAWIPS/comet/garp/gempak/linux64
make[3]: Entering directory `/home/gempak/GEMPAK6.2.0/comet/garp/gempak/linux64'
gcc -DUNDERSCORE -DLinux -I/home/gempak/GEMPAK6.2.0/gempak/include 
-I/home/gempak/GEMPAK6.2.0/os/linux64/include -I/usr/X11R6/include -DG_64BIT -g 
  -c ../garperr.c \
         \
        -I/usr/X11R6/include \
        -I/home/gempak/GEMPAK6.2.0/comet/garp/include \
        -I/home/gempak/GEMPAK6.2.0/gempak/include 
-I/home/gempak/GEMPAK6.2.0/os/linux64/include \
        -I/home/gempak/GEMPAK6.2.0/gempak/source/diaglib/dg \
        -I/home/gempak/GEMPAK6.2.0/comet/garp/xpm
make[3]: gcc: Command not found
make[3]: *** [garperr.o] Error 127
make[3]: Leaving directory `/home/gempak/GEMPAK6.2.0/comet/garp/gempak/linux64'
Making all in /home/gempak/NAWIPS/comet/garp/xpm/linux64
make[3]: Entering directory `/home/gempak/GEMPAK6.2.0/comet/garp/xpm/linux64'
gcc -DUNDERSCORE -DLinux -I/home/gempak/GEMPAK6.2.0/gempak/include 
-I/home/gempak/GEMPAK6.2.0/os/linux64/include -I/usr/X11R6/include -DG_64BIT -g 
  -c  ../data.c \
         \
        -I/usr/X11R6/include \
        -I/home/gempak/GEMPAK6.2.0/comet/garp/xpm
make[3]: gcc: Command not found
make[3]: *** [data.o] Error 127
make[3]: Leaving directory `/home/gempak/GEMPAK6.2.0/comet/garp/xpm/linux64'
make[2]: *** [LIB_DIR_ALL] Error 2
make[2]: Leaving directory `/home/gempak/GEMPAK6.2.0/comet/garp'
making in /home/gempak/NAWIPS/comet/etamap
make[2]: Entering directory `/home/gempak/GEMPAK6.2.0/comet/etamap'
gfortran -fno-second-underscore -fno-range-check -fd-lines-as-comments 
-I/home/gempak/GEMPAK6.2.0/gempak/include 
-I/home/gempak/GEMPAK6.2.0/os/linux64/include -g  -c etainp.f
make[2]: gfortran: Command not found
make[2]: *** [/home/gempak/GEMPAK6.2.0/os/linux64/lib/etamap.a(etainp.o)] Error 
127
make[2]: Leaving directory `/home/gempak/GEMPAK6.2.0/comet/etamap'
making in /home/gempak/NAWIPS/comet/gdpoint
make[2]: Entering directory `/home/gempak/GEMPAK6.2.0/comet/gdpoint'
make[2]: *** No rule to make target 
`/home/gempak/GEMPAK6.2.0/os/linux64/lib/ginitp_alt.o', needed by `all'.  Stop.
make[2]: Leaving directory `/home/gempak/GEMPAK6.2.0/comet/gdpoint'
making in /home/gempak/NAWIPS/comet/dcshef_comet
make[2]: Entering directory `/home/gempak/GEMPAK6.2.0/comet/dcshef_comet'
gcc -DUNDERSCORE -DLinux -I/home/gempak/GEMPAK6.2.0/gempak/include 
-I/home/gempak/GEMPAK6.2.0/os/linux64/include -I/usr/X11R6/include -DG_64BIT -g 
 -c -o dcshef_comet.o dcshef_comet.c
make[2]: gcc: Command not found
make[2]: *** [dcshef_comet.o] Error 127
make[2]: Leaving directory `/home/gempak/GEMPAK6.2.0/comet/dcshef_comet'
make[1]: Leaving directory `/home/gempak/GEMPAK6.2.0/comet'

What do I need to do to resolve the issue and successfully build the make?

Thanks!

Nathan Parker


WeatherBug Backyard Support