[Date Prev][Date Next][Thread Prev][Thread Next][Date Index][Thread Index]

[netCDF #SEL-204074]: NetCDF-4



> Thank you for email and fast answer. However, the clock issue was not my
> problem, as you can see (also in the previous email) I get FAIL: 30
> against only 1 PASS.
> I have recopied below these lines. Do you know how I could fix this?

No, the information you sent is insufficient to determine the problem, if it's
not clock skew.  Please send the file nf_test/test-suite.log with the details of
the failures.  It would also be helpful if you send the config.log file 
resulting
from running configure for netcdf-fortran-4.4.1.

--Russ

> FAIL: nf_test
> PASS: create_fills.sh
> FAIL: tst_f77_v2
> FAIL: ftst_vars
> FAIL: ftst_vars2
> FAIL: ftst_vars3
> FAIL: ftst_vars4
> FAIL: ftst_vars5
> FAIL: ftst_vars6
> FAIL: ftst_types
> FAIL: ftst_types2
> FAIL: ftst_types3
> FAIL: ftst_groups
> FAIL: ftst_path
> FAIL: ftst_rengrps
> FAIL: f90tst_vars
> FAIL: tst_types
> FAIL: tst_types2
> FAIL: f90tst_vars_vlen
> FAIL: tst_f90_nc4
> FAIL: f90tst_grps
> FAIL: f90tst_fill
> FAIL: f90tst_fill2
> FAIL: f90tst_vars3
> FAIL: f90tst_vars4
> FAIL: f90tst_vars2
> FAIL: f90tst_path
> FAIL: f90tst_rengrps
> FAIL: ftst_v2
> FAIL: ftest
> FAIL: tst_f90
> make[4]: Entering directory
> `/data/users/carlos/paraborrar/netcdf-fortran-4.4.1/nf_test'
> make[4]: Warning: File `.deps/fortlib.Po' has modification time 6.4e+02
> s in the future
> make[4]: Nothing to be done for `all'.
> make[4]: warning:  Clock skew detected.  Your build may be incomplete.
> make[4]: Leaving directory
> `/data/users/carlos/paraborrar/netcdf-fortran-4.4.1/nf_test'
> ============================================================================
> Testsuite summary for netCDF-Fortran 4.4.1
> ============================================================================
> # TOTAL: 31
> # PASS:  1
> # SKIP:  0
> # XFAIL: 0
> # FAIL:  30
> # XPASS: 0
> # ERROR: 0
> ============================================================================
> See nf_test/test-suite.log
> Please report address@hidden
> ============================================================================
> make[3]: *** [test-suite.log] Error 1
> make[3]: Leaving directory
> `/data/users/carlos/paraborrar/netcdf-fortran-4.4.1/nf_test'
> make[2]: *** [check-TESTS] Error 2
> make[2]: Leaving directory
> `/data/users/carlos/paraborrar/netcdf-fortran-4.4.1/nf_test'
> make[1]: *** [check-am] Error 2
> make[1]: Leaving directory
> `/data/users/carlos/paraborrar/netcdf-fortran-4.4.1/nf_test'
> make: *** [check-recursive] Error 1
> 
> 
> 
> 
> 
> 
> 
> 
> On 23/09/2014 02:43, Unidata netCDF Support wrote:
> > FAIL: nf_test
> > >PASS: create_fills.sh
> > >FAIL: tst_f77_v2
> > >FAIL: ftst_vars
> > >FAIL: ftst_vars2
> > >FAIL: ftst_vars3
> > >FAIL: ftst_vars4
> > >FAIL: ftst_vars5
> > >FAIL: ftst_vars6
> > >FAIL: ftst_types
> > >FAIL: ftst_types2
> > >FAIL: ftst_types3
> > >FAIL: ftst_groups
> > >FAIL: ftst_path
> > >FAIL: ftst_rengrps
> > >FAIL: f90tst_vars
> > >FAIL: tst_types
> > >FAIL: tst_types2
> > >FAIL: f90tst_vars_vlen
> > >FAIL: tst_f90_nc4
> > >FAIL: f90tst_grps
> > >FAIL: f90tst_fill
> > >FAIL: f90tst_fill2
> > >FAIL: f90tst_vars3
> > >FAIL: f90tst_vars4
> > >FAIL: f90tst_vars2
> > >FAIL: f90tst_path
> > >FAIL: f90tst_rengrps
> > >FAIL: ftst_v2
> > >FAIL: ftest
> > >FAIL: tst_f90
> > >make[4]: Entering directory
> > >`/data/users/carlos/paraborrar/netcdf-fortran-4.4.1/nf_test'
> > >make[4]: Warning: File `.deps/fortlib.Po' has modification time 6.4e+02
> > >s in the future
> > >make[4]: Nothing to be done for `all'.
> > >make[4]: warning:  Clock skew detected.  Your build may be incomplete.
> > >make[4]: Leaving directory
> > >`/data/users/carlos/paraborrar/netcdf-fortran-4.4.1/nf_test'
> > >============================================================================
> > >Testsuite summary for netCDF-Fortran 4.4.1
> > >============================================================================
> > ># TOTAL: 31
> > ># PASS:  1
> > ># SKIP:  0
> > ># XFAIL: 0
> > ># FAIL:  30
> > ># XPASS: 0
> > ># ERROR: 0
> > >============================================================================
> > >See nf_test/test-suite.log
> > >Please report address@hidden
> > >============================================================================
> > >make[3]: *** [test-suite.log] Error 1
> > >make[3]: Leaving directory
> > >`/data/users/carlos/paraborrar/netcdf-fortran-4.4.1/nf_test'
> > >make[2]: *** [check-TESTS] Error 2
> > >make[2]: Leaving directory
> > >`/data/users/carlos/paraborrar/netcdf-fortran-4.4.1/nf_test'
> > >make[1]: *** [check-am] Error 2
> > >make[1]: Leaving directory
> > >`/data/users/carlos/paraborrar/netcdf-fortran-4.4.1/nf_test'
> > >make: *** [check-recursive] Error 1
> 
> --
> Dr. Carlos ArgÃez GarcÃa
> Postdoctoral Research Fellow
> Science Institute,
> University of Iceland,
> HjarÃarhagi 2, VR-III
> 107 ReykjavÃk, Iceland
> Tel: +3545254701
> www.hi.is/~carlos
> 
> 
Russ Rew                                         UCAR Unidata Program
address@hidden                      http://www.unidata.ucar.edu



Ticket Details
===================
Ticket ID: SEL-204074
Department: Support netCDF
Priority: Normal
Status: Closed


NOTE: All email exchanges with Unidata User Support are recorded in the Unidata inquiry tracking system and then made publicly available through the web. If you do not want to have your interactions made available in this way, you must let us know in each email you send to us.