[Date Prev][Date Next][Thread Prev][Thread Next][Date Index][Thread Index]

[netCDF #WOU-310389]: netcdf install error


Can you provide the test-suite.log file generated when you run this test?  I 
suspect it is related to a change in our test server.  If the test failing 
relates to remote data access, you can safely ignore the failure.


> Dear sir or madam,
> When I installing netcdf-4.1.3 with hdf5,in the make check step it showns 
> error message,the error message in following:
> 1 of 50 tests failed
> Please report to address@hidden
> ================================================
> make[2]: *** [check-TESTS] Error 1
> make[2]: Leaving directory `/opt/netcdf-4.1.3/nc_test4'
> make[1]: *** [check-am] Error 2
> make[1]: Leaving directory `/opt/netcdf-4.1.3/nc_test4'
> make: *** [check-recursive] Error 1
> I configured with this command:CPPFLAGS=-I/usr/local/hdf5/include 
> LDFLAGS=-L/usr/local/hdf5/lib ./configure --prefix=/opt/netcdf FC=ifort 
> F77=ifort F90=ifort CC=icc CXX=icpc
> Can you point up my error,thank you!
> Best wishes for you!
> Sincerely,
> Yuli

Ticket Details
Ticket ID: WOU-310389
Department: Support netCDF
Priority: Normal
Status: Closed

NOTE: All email exchanges with Unidata User Support are recorded in the Unidata inquiry tracking system and then made publicly available through the web. If you do not want to have your interactions made available in this way, you must let us know in each email you send to us.