[Date Prev][Date Next][Thread Prev][Thread Next][Date Index][Thread Index]

[netCDF #XPE-388375]: netcdf check report



Hi,

According to the test-suite.log you attached, you are using HDF5-1.8.5, but 
netCDF-4 version 4.3.3.1 requires at least HDF5-1.8.9, so you need to
update your HDF5 library, preferably to the latest release (1.8.15) but to
at least 1.8.9 before building a recent version of netCDF.

See the netCDF version requirements here:

  
http://www.unidata.ucar.edu/software/netcdf/docs/getting_and_building_netcdf.html#netcdf_requirements

--Russ

> make[8]: Leaving directory
> `/home/cclm2/local/src/netcdf-4.3.3.1/ncdump/expected'
> make[8]: Entering directory `/home/cclm2/local/src/netcdf-4.3.3.1/ncdump'
> make[8]: Nothing to be done for `all-am'.
> make[8]: Leaving directory `/home/cclm2/local/src/netcdf-4.3.3.1/ncdump'
> make[7]: Leaving directory `/home/cclm2/local/src/netcdf-4.3.3.1/ncdump'
> make[6]: Leaving directory `/home/cclm2/local/src/netcdf-4.3.3.1/ncdump'
> ============================================================================
> Testsuite summary for netCDF 4.3.3.1
> ============================================================================
> # TOTAL: 40
> # PASS:  38
> # SKIP:  0
> # XFAIL: 0
> # FAIL:  2
> # XPASS: 0
> # ERROR: 0
> ============================================================================
> See ncdump/test-suite.log
> Please report to address@hidden
> ============================================================================
> make[5]: *** [test-suite.log] Error 1
> make[5]: Leaving directory `/home/cclm2/local/src/netcdf-4.3.3.1/ncdump'
> make[4]: *** [check-TESTS] Error 2
> make[4]: Leaving directory `/home/cclm2/local/src/netcdf-4.3.3.1/ncdump'
> make[3]: *** [check-am] Error 2
> make[3]: Leaving directory `/home/cclm2/local/src/netcdf-4.3.3.1/ncdump'
> make[2]: *** [check-recursive] Error 1
> make[2]: Leaving directory `/home/cclm2/local/src/netcdf-4.3.3.1/ncdump'
> make[1]: *** [check] Error 2
> make[1]: Leaving directory `/home/cclm2/local/src/netcdf-4.3.3.1/ncdump'
> make: *** [check-recursive] Error 1
> 
> 
> From:    Remzi AKYÃZ <address@hidden>
> Date:    Sat, 29 Aug 2015 12:44:52 +0300
> 
> ==================================================
> netCDF-Fortran 4.4.2: nf_test/test-suite.log
> ==================================================
> 
> # TOTAL: 31
> # PASS:  30
> # SKIP:  0
> # XFAIL: 0
> # FAIL:  0
> # XPASS: 0
> # ERROR: 1
> 
> .. contents:: :depth: 2
> 
> ERROR: f90tst_fill2
> ===================
> 
> STOP 99
> 
> *** Testing netCDF-4 fill values with unlimited dimension.
> Error: NetCDF: HDF error
> ERROR f90tst_fill2 (exit status: 99)
> 
> --
> 
> 
> ?yi Ãal??malar.
> 
> 
> Remzi AKYÃZ <http://remziakyuz.blogspot.com.tr/>
> 
> *Oracle Certified Professional, Oracle Solaris 11 System Administrator
> Oracle Linux 6 Certified Implementation Specialist*
> *Oracle VM 3.0 for x86/SPARC Certified Implementation Specialist *
> *Sun Storage 7000/ZS3 Unified Storage Systems Certified Implementation
> Specialist*
> Eduline Bili?im Sanayi ve Ticaret Ltd.?ti.
> Nisbetiye Mah. GÃmÃ? Sok. No:5 K?r Apt. B Blok D:4,34340,Ulus, Be?ikta?
> / ?stanbul
> Tel : 212-324 60 61, Fax : 212-324 65 70, GSM : 0 545 670 6312
> *http://www.eduline.com.tr/ *
> 
> 
> 
Russ Rew                                         UCAR Unidata Program
address@hidden                      http://www.unidata.ucar.edu



Ticket Details
===================
Ticket ID: XPE-388375
Department: Support netCDF
Priority: Normal
Status: Closed


NOTE: All email exchanges with Unidata User Support are recorded in the Unidata inquiry tracking system and then made publicly available through the web. If you do not want to have your interactions made available in this way, you must let us know in each email you send to us.