[Date Prev][Date Next][Thread Prev][Thread Next][Date Index][Thread Index]

[netCDF #SNV-228271]: netCDF "make check" fails

Hi Kenneth,

> *** Total number of failures: 3817
> *** nc_test FAILURE!!!
> FAIL: nc_test
> ================================================
> 1 of 12 tests failed
> Please report to address@hidden
> ================================================
> make[2]: *** [check-TESTS] Error 1
> make[2]: Leaving directory `/media/sdd2/downloads/ncdf/netcdf-4.3.0/nc_test'
> make[1]: *** [check-am] Error 2
> make[1]: Leaving directory `/media/sdd2/downloads/ncdf/netcdf-4.3.0/nc_test'
> make: *** [check-recursive] Error 1
> uname -a
> Linux kenneth-principal 3.2.0-41-generic #66-Ubuntu SMP Thu Apr 25 03:27:11
> UTC 2013 x86_64 x86_64 x86_64 GNU/Linux

We'll need more information to determine what the problem is.  Could you please
send us the config.log file produced by running the configure script and the
complete output from "make check"?  Also the version of netCDF you were trying
to build.



Russ Rew                                         UCAR Unidata Program
address@hidden                      http://www.unidata.ucar.edu

Ticket Details
Ticket ID: SNV-228271
Department: Support netCDF
Priority: Normal
Status: Closed

NOTE: All email exchanges with Unidata User Support are recorded in the Unidata inquiry tracking system and then made publicly available through the web. If you do not want to have your interactions made available in this way, you must let us know in each email you send to us.