[Date Prev][Date Next][Thread Prev][Thread Next][Date Index][Thread Index]

[netCDF #ZIV-541197]: netcdf compiling error


> I had netcdf before, and I tried to install it today. However, it keeps
> showing 2 of 7 tests failed.
> My configure command was ./configure --prefix=/home/ed/local
> --disable-netcdf-4.
> I was wondering if I should change any environmental setting to fix this?
> make[4]: *** [check-TESTS] Error 1
> make[4]: Leaving directory
> `/nfs/user03/ams528/ythuang/netcdf-4.1.3/ncdap_test'
> make[3]: *** [check-am] Error 2
> make[3]: Leaving directory
> `/nfs/user03/ams528/ythuang/netcdf-4.1.3/ncdap_test'
> make[2]: *** [check-recursive] Error 1
> make[2]: Leaving directory
> `/nfs/user03/ams528/ythuang/netcdf-4.1.3/ncdap_test'
> make[1]: *** [check] Error 2
> make[1]: Leaving directory
> `/nfs/user03/ams528/ythuang/netcdf-4.1.3/ncdap_test'
> make: *** [check-recursive] Error 1

We'll need more information to determine what the problem is.

Could you please send us the output from running the configure script
(config.log) and the output from running "make check"?  They're large,
but you can include them as attachments.


Russ Rew                                         UCAR Unidata Program
address@hidden                      http://www.unidata.ucar.edu

Ticket Details
Ticket ID: ZIV-541197
Department: Support netCDF
Priority: Normal
Status: Closed

NOTE: All email exchanges with Unidata User Support are recorded in the Unidata inquiry tracking system and then made publicly available through the web. If you do not want to have your interactions made available in this way, you must let us know in each email you send to us.