[Date Prev][Date Next][Thread Prev][Thread Next][Date Index][Thread Index]

[netCDF #NVG-153188]: netcdf install error


> 1 of 59 tests failed
> Please report to address@hidden
> ================================================
> make[2]: *** [check-TESTS] error 1
> make[2]: Leaving directory `/usr/local/netcdf-4.1.1/libsrc4'
> make[1]: *** [check-am] error 2
> make[1]: Leaving directory `/usr/local/netcdf-4.1.1/libsrc4'
> make: *** [check-recursive] error 1

What you are seeing looks like an incompatibility we just noticed between
netCDF version 4.1.1 and the latest HDF5 version 1.8.6.  Until this is fixed,
a possible workaround would be to build netCDF-4.1.1 against HDF5-1.8.5-patch1
or build the current netCDF daily snapshot or netCDF version 4.1.2-beta2 with
HDF5-1.8.6.  Both those combinations are known to work.


Russ Rew                                         UCAR Unidata Program
address@hidden                      http://www.unidata.ucar.edu

Ticket Details
Ticket ID: NVG-153188
Department: Support netCDF
Priority: Normal
Status: Closed

NOTE: All email exchanges with Unidata User Support are recorded in the Unidata inquiry tracking system and then made publicly available through the web. If you do not want to have your interactions made available in this way, you must let us know in each email you send to us.