Installing any netCDF under cygwin

Hi,

I'm trying to install netCDF under cygwin on windows XP. I downloaded
several netcdf sources (3.6.0, 3.6.1, 3.6.2, 4.0) and got the same
problem with all.
I first ran './configure' (without any flag), and then 'make test', and
it failed in nf_test directory. I also tried with some flags such as
CC=gcc, FC=g77, CXX=g++, without any difference in the compilation.
I have installed gfortran (f90 compiler) but I still have the same problem.

The problem is there:
/bin/sh ../libtool --tag=F77 --mode=link g77   -I../libsrc
-Wno-globals   -o nf_test.exe  test_get.o test_put.o nf_error.o
nf_test.o test_read.o test_write.o util.o fortlib.o
../libsrc/libnetcdf.la
libtool: link: g77 -I../libsrc -Wno-globals -o nf_test.exe test_get.o
test_put.o nf_error.o nf_test.o test_read.o test_write.o util.o
fortlib.o  ../libsrc/.libs/libnetcdf.a
test_get.o: In function `test_nf_get_att_double_':
netcdf-3.6.2/nf_test/test_get.F:5511: undefined reference to `_nf_open_'
netcdf-3.6.2/nf_test/test_get.F:5521: undefined reference to
`_nf_get_att_double_'
netcdf-3.6.2/nf_test/test_get.F:5526: undefined reference to
`_nf_get_att_double_'
netcdf-3.6.2/nf_test/test_get.F:5529: undefined reference to
`_nf_get_att_double_'
[...]

I have seen some messages telling to move /usr/bin to the front of the
PATH, but it didn't change anything.
I attach the configure log and the make log to this email.

Thanks for any help.
Regards,

          Didier

--
----------------------------------------------------------------
Didier AUROUX                     Bureau: 318
Tel:     +33 (0)5.61.55.76.42     Fax.: +33 (0)5.61.55.83.85
E_Mail:  auroux@xxxxxxxxxxxxxxx   http://mip.ups-tlse.fr/~auroux
Adresse: Institut de Mathematiques de Toulouse - UMR 5219
         Universite Paul Sabatier Toulouse 3
         31062 Toulouse cedex 9 - France
----------------------------------------------------------------


Making check in fortran
make[1]: Entering directory `/home/auroux/netcdf-3.6.2/fortran'
depbase=`echo fort-attio.lo | sed 's|[^/]*$|.deps/&|;s|\.lo$||'`; \
        if /bin/sh ../libtool --tag=CC --mode=compile gcc -DHAVE_CONFIG_H -I. 
-I. -I.. -I.    -I../libsrc  -Df2cFortran  -g -O2 -MT fort-attio.lo -MD -MP -MF 
"$depbase.Tpo" -c -o fort-attio.lo fort-attio.c; \
        then mv -f "$depbase.Tpo" "$depbase.Plo"; else rm -f "$depbase.Tpo"; 
exit 1; fi
libtool: compile:  gcc -DHAVE_CONFIG_H -I. -I. -I.. -I. -I../libsrc 
-Df2cFortran -g -O2 -MT fort-attio.lo -MD -MP -MF .deps/fort-attio.Tpo -c 
fort-attio.c -o fort-attio.o
depbase=`echo fort-control.lo | sed 's|[^/]*$|.deps/&|;s|\.lo$||'`; \
        if /bin/sh ../libtool --tag=CC --mode=compile gcc -DHAVE_CONFIG_H -I. 
-I. -I.. -I.    -I../libsrc  -Df2cFortran  -g -O2 -MT fort-control.lo -MD -MP 
-MF "$depbase.Tpo" -c -o fort-control.lo fort-control.c; \
        then mv -f "$depbase.Tpo" "$depbase.Plo"; else rm -f "$depbase.Tpo"; 
exit 1; fi
libtool: compile:  gcc -DHAVE_CONFIG_H -I. -I. -I.. -I. -I../libsrc 
-Df2cFortran -g -O2 -MT fort-control.lo -MD -MP -MF .deps/fort-control.Tpo -c 
fort-control.c -o fort-control.o
depbase=`echo fort-dim.lo | sed 's|[^/]*$|.deps/&|;s|\.lo$||'`; \
        if /bin/sh ../libtool --tag=CC --mode=compile gcc -DHAVE_CONFIG_H -I. 
-I. -I.. -I.    -I../libsrc  -Df2cFortran  -g -O2 -MT fort-dim.lo -MD -MP -MF 
"$depbase.Tpo" -c -o fort-dim.lo fort-dim.c; \
        then mv -f "$depbase.Tpo" "$depbase.Plo"; else rm -f "$depbase.Tpo"; 
exit 1; fi
libtool: compile:  gcc -DHAVE_CONFIG_H -I. -I. -I.. -I. -I../libsrc 
-Df2cFortran -g -O2 -MT fort-dim.lo -MD -MP -MF .deps/fort-dim.Tpo -c 
fort-dim.c -o fort-dim.o
depbase=`echo fort-genatt.lo | sed 's|[^/]*$|.deps/&|;s|\.lo$||'`; \
        if /bin/sh ../libtool --tag=CC --mode=compile gcc -DHAVE_CONFIG_H -I. 
-I. -I.. -I.    -I../libsrc  -Df2cFortran  -g -O2 -MT fort-genatt.lo -MD -MP 
-MF "$depbase.Tpo" -c -o fort-genatt.lo fort-genatt.c; \
        then mv -f "$depbase.Tpo" "$depbase.Plo"; else rm -f "$depbase.Tpo"; 
exit 1; fi
libtool: compile:  gcc -DHAVE_CONFIG_H -I. -I. -I.. -I. -I../libsrc 
-Df2cFortran -g -O2 -MT fort-genatt.lo -MD -MP -MF .deps/fort-genatt.Tpo -c 
fort-genatt.c -o fort-genatt.o
depbase=`echo fort-geninq.lo | sed 's|[^/]*$|.deps/&|;s|\.lo$||'`; \
        if /bin/sh ../libtool --tag=CC --mode=compile gcc -DHAVE_CONFIG_H -I. 
-I. -I.. -I.    -I../libsrc  -Df2cFortran  -g -O2 -MT fort-geninq.lo -MD -MP 
-MF "$depbase.Tpo" -c -o fort-geninq.lo fort-geninq.c; \
        then mv -f "$depbase.Tpo" "$depbase.Plo"; else rm -f "$depbase.Tpo"; 
exit 1; fi
libtool: compile:  gcc -DHAVE_CONFIG_H -I. -I. -I.. -I. -I../libsrc 
-Df2cFortran -g -O2 -MT fort-geninq.lo -MD -MP -MF .deps/fort-geninq.Tpo -c 
fort-geninq.c -o fort-geninq.o
depbase=`echo fort-genvar.lo | sed 's|[^/]*$|.deps/&|;s|\.lo$||'`; \
        if /bin/sh ../libtool --tag=CC --mode=compile gcc -DHAVE_CONFIG_H -I. 
-I. -I.. -I.    -I../libsrc  -Df2cFortran  -g -O2 -MT fort-genvar.lo -MD -MP 
-MF "$depbase.Tpo" -c -o fort-genvar.lo fort-genvar.c; \
        then mv -f "$depbase.Tpo" "$depbase.Plo"; else rm -f "$depbase.Tpo"; 
exit 1; fi
libtool: compile:  gcc -DHAVE_CONFIG_H -I. -I. -I.. -I. -I../libsrc 
-Df2cFortran -g -O2 -MT fort-genvar.lo -MD -MP -MF .deps/fort-genvar.Tpo -c 
fort-genvar.c -o fort-genvar.o
depbase=`echo fort-lib.lo | sed 's|[^/]*$|.deps/&|;s|\.lo$||'`; \
        if /bin/sh ../libtool --tag=CC --mode=compile gcc -DHAVE_CONFIG_H -I. 
-I. -I.. -I.    -I../libsrc  -Df2cFortran  -g -O2 -MT fort-lib.lo -MD -MP -MF 
"$depbase.Tpo" -c -o fort-lib.lo fort-lib.c; \
        then mv -f "$depbase.Tpo" "$depbase.Plo"; else rm -f "$depbase.Tpo"; 
exit 1; fi
libtool: compile:  gcc -DHAVE_CONFIG_H -I. -I. -I.. -I. -I../libsrc 
-Df2cFortran -g -O2 -MT fort-lib.lo -MD -MP -MF .deps/fort-lib.Tpo -c 
fort-lib.c -o fort-lib.o
depbase=`echo fort-misc.lo | sed 's|[^/]*$|.deps/&|;s|\.lo$||'`; \
        if /bin/sh ../libtool --tag=CC --mode=compile gcc -DHAVE_CONFIG_H -I. 
-I. -I.. -I.    -I../libsrc  -Df2cFortran  -g -O2 -MT fort-misc.lo -MD -MP -MF 
"$depbase.Tpo" -c -o fort-misc.lo fort-misc.c; \
        then mv -f "$depbase.Tpo" "$depbase.Plo"; else rm -f "$depbase.Tpo"; 
exit 1; fi
libtool: compile:  gcc -DHAVE_CONFIG_H -I. -I. -I.. -I. -I../libsrc 
-Df2cFortran -g -O2 -MT fort-misc.lo -MD -MP -MF .deps/fort-misc.Tpo -c 
fort-misc.c -o fort-misc.o
depbase=`echo fort-v2compat.lo | sed 's|[^/]*$|.deps/&|;s|\.lo$||'`; \
        if /bin/sh ../libtool --tag=CC --mode=compile gcc -DHAVE_CONFIG_H -I. 
-I. -I.. -I.    -I../libsrc  -Df2cFortran  -g -O2 -MT fort-v2compat.lo -MD -MP 
-MF "$depbase.Tpo" -c -o fort-v2compat.lo fort-v2compat.c; \
        then mv -f "$depbase.Tpo" "$depbase.Plo"; else rm -f "$depbase.Tpo"; 
exit 1; fi
libtool: compile:  gcc -DHAVE_CONFIG_H -I. -I. -I.. -I. -I../libsrc 
-Df2cFortran -g -O2 -MT fort-v2compat.lo -MD -MP -MF .deps/fort-v2compat.Tpo -c 
fort-v2compat.c -o fort-v2compat.o
depbase=`echo fort-vario.lo | sed 's|[^/]*$|.deps/&|;s|\.lo$||'`; \
        if /bin/sh ../libtool --tag=CC --mode=compile gcc -DHAVE_CONFIG_H -I. 
-I. -I.. -I.    -I../libsrc  -Df2cFortran  -g -O2 -MT fort-vario.lo -MD -MP -MF 
"$depbase.Tpo" -c -o fort-vario.lo fort-vario.c; \
        then mv -f "$depbase.Tpo" "$depbase.Plo"; else rm -f "$depbase.Tpo"; 
exit 1; fi
libtool: compile:  gcc -DHAVE_CONFIG_H -I. -I. -I.. -I. -I../libsrc 
-Df2cFortran -g -O2 -MT fort-vario.lo -MD -MP -MF .deps/fort-vario.Tpo -c 
fort-vario.c -o fort-vario.o
depbase=`echo fort-var1io.lo | sed 's|[^/]*$|.deps/&|;s|\.lo$||'`; \
        if /bin/sh ../libtool --tag=CC --mode=compile gcc -DHAVE_CONFIG_H -I. 
-I. -I.. -I.    -I../libsrc  -Df2cFortran  -g -O2 -MT fort-var1io.lo -MD -MP 
-MF "$depbase.Tpo" -c -o fort-var1io.lo fort-var1io.c; \
        then mv -f "$depbase.Tpo" "$depbase.Plo"; else rm -f "$depbase.Tpo"; 
exit 1; fi
libtool: compile:  gcc -DHAVE_CONFIG_H -I. -I. -I.. -I. -I../libsrc 
-Df2cFortran -g -O2 -MT fort-var1io.lo -MD -MP -MF .deps/fort-var1io.Tpo -c 
fort-var1io.c -o fort-var1io.o
depbase=`echo fort-varaio.lo | sed 's|[^/]*$|.deps/&|;s|\.lo$||'`; \
        if /bin/sh ../libtool --tag=CC --mode=compile gcc -DHAVE_CONFIG_H -I. 
-I. -I.. -I.    -I../libsrc  -Df2cFortran  -g -O2 -MT fort-varaio.lo -MD -MP 
-MF "$depbase.Tpo" -c -o fort-varaio.lo fort-varaio.c; \
        then mv -f "$depbase.Tpo" "$depbase.Plo"; else rm -f "$depbase.Tpo"; 
exit 1; fi
libtool: compile:  gcc -DHAVE_CONFIG_H -I. -I. -I.. -I. -I../libsrc 
-Df2cFortran -g -O2 -MT fort-varaio.lo -MD -MP -MF .deps/fort-varaio.Tpo -c 
fort-varaio.c -o fort-varaio.o
depbase=`echo fort-varmio.lo | sed 's|[^/]*$|.deps/&|;s|\.lo$||'`; \
        if /bin/sh ../libtool --tag=CC --mode=compile gcc -DHAVE_CONFIG_H -I. 
-I. -I.. -I.    -I../libsrc  -Df2cFortran  -g -O2 -MT fort-varmio.lo -MD -MP 
-MF "$depbase.Tpo" -c -o fort-varmio.lo fort-varmio.c; \
        then mv -f "$depbase.Tpo" "$depbase.Plo"; else rm -f "$depbase.Tpo"; 
exit 1; fi
libtool: compile:  gcc -DHAVE_CONFIG_H -I. -I. -I.. -I. -I../libsrc 
-Df2cFortran -g -O2 -MT fort-varmio.lo -MD -MP -MF .deps/fort-varmio.Tpo -c 
fort-varmio.c -o fort-varmio.o
depbase=`echo fort-varsio.lo | sed 's|[^/]*$|.deps/&|;s|\.lo$||'`; \
        if /bin/sh ../libtool --tag=CC --mode=compile gcc -DHAVE_CONFIG_H -I. 
-I. -I.. -I.    -I../libsrc  -Df2cFortran  -g -O2 -MT fort-varsio.lo -MD -MP 
-MF "$depbase.Tpo" -c -o fort-varsio.lo fort-varsio.c; \
        then mv -f "$depbase.Tpo" "$depbase.Plo"; else rm -f "$depbase.Tpo"; 
exit 1; fi
libtool: compile:  gcc -DHAVE_CONFIG_H -I. -I. -I.. -I. -I../libsrc 
-Df2cFortran -g -O2 -MT fort-varsio.lo -MD -MP -MF .deps/fort-varsio.Tpo -c 
fort-varsio.c -o fort-varsio.o
/bin/sh ../libtool --tag=CC --mode=link gcc  -g -O2   -o libnetcdff.la   
fort-attio.lo fort-control.lo fort-dim.lo fort-genatt.lo fort-geninq.lo 
fort-genvar.lo fort-lib.lo fort-misc.lo fort-v2compat.lo fort-vario.lo 
fort-var1io.lo fort-varaio.lo fort-varmio.lo fort-varsio.lo   
libtool: link: rm -fr  .libs/libnetcdff.a .libs/libnetcdff.la
libtool: link: ar cru .libs/libnetcdff.a  fort-attio.o fort-control.o 
fort-dim.o fort-genatt.o fort-geninq.o fort-genvar.o fort-lib.o fort-misc.o 
fort-v2compat.o fort-vario.o fort-var1io.o fort-varaio.o fort-varmio.o 
fort-varsio.o
libtool: link: ranlib .libs/libnetcdff.a
libtool: link: creating libnetcdff.la
libtool: link: ( cd ".libs" && rm -f "libnetcdff.la" && ln -s 
"../libnetcdff.la" "libnetcdff.la" )
make[1]: Leaving directory `/home/auroux/netcdf-3.6.2/fortran'
Making check in libsrc
make[1]: Entering directory `/home/auroux/netcdf-3.6.2/libsrc'
/bin/sh ../libtool --tag=CC --mode=link gcc  -g -O2   -o libnetcdf.la -rpath 
/usr/local/lib  -version-info 4:0:0 -no-undefined  attr.lo ncx.lo putget.lo 
dim.lo error.lo libvers.lo nc.lo string.lo v1hpg.lo var.lo  posixio.lo 
libnetcdf2.la ../fortran/libnetcdff.la 
libtool: link: rm -fr  .libs/libnetcdf.a .libs/libnetcdf.la .libs/libnetcdf.lai
libtool: link: (cd .libs/libnetcdf.lax/libnetcdf2.a && ar x 
/home/auroux/netcdf-3.6.2/libsrc/./.libs/libnetcdf2.a)
libtool: link: (cd .libs/libnetcdf.lax/libnetcdff.a && ar x 
/home/auroux/netcdf-3.6.2/libsrc/../fortran/.libs/libnetcdff.a)
libtool: link: ar cru .libs/libnetcdf.a  attr.o ncx.o putget.o dim.o error.o 
libvers.o nc.o string.o v1hpg.o var.o posixio.o  
.libs/libnetcdf.lax/libnetcdf2.a/v2i.o  
.libs/libnetcdf.lax/libnetcdff.a/fort-attio.o 
.libs/libnetcdf.lax/libnetcdff.a/fort-control.o 
.libs/libnetcdf.lax/libnetcdff.a/fort-dim.o 
.libs/libnetcdf.lax/libnetcdff.a/fort-genatt.o 
.libs/libnetcdf.lax/libnetcdff.a/fort-geninq.o 
.libs/libnetcdf.lax/libnetcdff.a/fort-genvar.o 
.libs/libnetcdf.lax/libnetcdff.a/fort-lib.o 
.libs/libnetcdf.lax/libnetcdff.a/fort-misc.o 
.libs/libnetcdf.lax/libnetcdff.a/fort-v2compat.o 
.libs/libnetcdf.lax/libnetcdff.a/fort-var1io.o 
.libs/libnetcdf.lax/libnetcdff.a/fort-varaio.o 
.libs/libnetcdf.lax/libnetcdff.a/fort-vario.o 
.libs/libnetcdf.lax/libnetcdff.a/fort-varmio.o 
.libs/libnetcdf.lax/libnetcdff.a/fort-varsio.o 
libtool: link: ranlib .libs/libnetcdf.a
libtool: link: rm -fr .libs/libnetcdf.lax
libtool: link: creating libnetcdf.la
libtool: link: ( cd ".libs" && rm -f "libnetcdf.la" && ln -s "../libnetcdf.la" 
"libnetcdf.la" )
make  t_nc.exe
make[2]: Entering directory `/home/auroux/netcdf-3.6.2/libsrc'
/bin/sh ../libtool --tag=CC --mode=link gcc  -g -O2   -o t_nc.exe  t_nc-t_nc.o 
libnetcdf.la 
libtool: link: gcc -g -O2 -o t_nc.exe t_nc-t_nc.o  ./.libs/libnetcdf.a
make[2]: Leaving directory `/home/auroux/netcdf-3.6.2/libsrc'
make  check-TESTS
make[2]: Entering directory `/home/auroux/netcdf-3.6.2/libsrc'
trying again
dimrename: IXX
nc_close ret = 0

reopen id = 4 for filename test.nc
NC done
GATTR VAR VATTR
VATTR
VATTR
VATTR
VATTR
VATTR
fill_seq indices         1 2 3  75.000000 != 2.718282
Done
got val = 3.250000
got val = 0.000000
got val = 2.718282
got val = 82555
got val = 97
got NC_CHAR val = A (0x41) 
got NC_CHAR val = B (0x42) 
got NC_CHAR val = "The red death had long devastated the country."
got val = A (0x41) 
got val = B (0x42) 
got val = "The red death had long devastated the country."
got vals = 0.000000 ... 447.000000
re nc_close ret = 0
PASS: t_nc
=================
All 1 tests passed
=================
make[2]: Leaving directory `/home/auroux/netcdf-3.6.2/libsrc'
make[1]: Leaving directory `/home/auroux/netcdf-3.6.2/libsrc'
Making check in nctest
make[1]: Entering directory `/home/auroux/netcdf-3.6.2/nctest'
make  nctest.exe
make[2]: Entering directory `/home/auroux/netcdf-3.6.2/nctest'
/bin/sh ../libtool --tag=CC --mode=link gcc  -g -O2 -L../libsrc  -o nctest.exe  
add.o atttests.o cdftests.o dimtests.o driver.o emalloc.o error.o misctest.o 
rec.o slabs.o val.o vardef.o varget.o vargetg.o varput.o varputg.o vartests.o 
vputget.o vputgetg.o -lm  ../libsrc/libnetcdf.la 
libtool: link: gcc -g -O2 -o nctest.exe add.o atttests.o cdftests.o dimtests.o 
driver.o emalloc.o error.o misctest.o rec.o slabs.o val.o vardef.o varget.o 
vargetg.o varput.o varputg.o vartests.o vputget.o vputgetg.o  
-L/home/auroux/netcdf-3.6.2/libsrc ../libsrc/.libs/libnetcdf.a
make[2]: Leaving directory `/home/auroux/netcdf-3.6.2/nctest'
make  check-TESTS
make[2]: Entering directory `/home/auroux/netcdf-3.6.2/nctest'
Testing V2 API with 2 different netCDF formats.


Switching to netCDF classic format.
*** Testing nccreate ...        ok ***
*** Testing ncopen ...          ok ***
*** Testing ncredef ...         ok ***
*** Testing ncendef ...         ok ***
*** Testing ncclose ...         ok ***
*** Testing ncinquire ...       ok ***
*** Testing ncsync ...          ok ***
*** Testing ncabort ...         ok ***
*** Testing ncdimdef ...        ok ***
*** Testing ncdimid ...         ok ***
*** Testing ncdiminq ...        ok ***
*** Testing ncdimrename ...     ok ***
*** Testing ncvardef ...        ok ***
*** Testing ncvarid ...         ok ***
*** Testing ncvarinq ...        ok ***
*** Testing ncvarput1 ...       ok ***
*** Testing ncvarget1 ...       ok ***
*** Testing ncvarput ...        ok ***
*** Testing ncvarget ...        ok ***
*** Testing ncvarputg ...       ok ***
*** Testing ncvargetg ...       ok ***
*** Testing ncrecinq ...        ok ***
*** Testing ncrecput ...        ok ***
*** Testing ncrecget ...        ok ***
*** Testing ncvarrename ...     ok ***
*** Testing ncattput ...        ok ***
*** Testing ncattinq ...        ok ***
*** Testing ncattget ...        ok ***
*** Testing ncattcopy ...       ok ***
*** Testing ncattname ...       ok ***
*** Testing ncattrename ...     ok ***
*** Testing ncattdel ...        ok ***
*** Testing nctypelen ...       ok ***


Switching to 64-bit offset format.
*** Testing nccreate ...        ok ***
*** Testing ncopen ...          ok ***
*** Testing ncredef ...         ok ***
*** Testing ncendef ...         ok ***
*** Testing ncclose ...         ok ***
*** Testing ncinquire ...       ok ***
*** Testing ncsync ...          ok ***
*** Testing ncabort ...         ok ***
*** Testing ncdimdef ...        ok ***
*** Testing ncdimid ...         ok ***
*** Testing ncdiminq ...        ok ***
*** Testing ncdimrename ...     ok ***
*** Testing ncvardef ...        ok ***
*** Testing ncvarid ...         ok ***
*** Testing ncvarinq ...        ok ***
*** Testing ncvarput1 ...       ok ***
*** Testing ncvarget1 ...       ok ***
*** Testing ncvarput ...        ok ***
*** Testing ncvarget ...        ok ***
*** Testing ncvarputg ...       ok ***
*** Testing ncvargetg ...       ok ***
*** Testing ncrecinq ...        ok ***
*** Testing ncrecput ...        ok ***
*** Testing ncrecget ...        ok ***
*** Testing ncvarrename ...     ok ***
*** Testing ncattput ...        ok ***
*** Testing ncattinq ...        ok ***
*** Testing ncattget ...        ok ***
*** Testing ncattcopy ...       ok ***
*** Testing ncattname ...       ok ***
*** Testing ncattrename ...     ok ***
*** Testing ncattdel ...        ok ***
*** Testing nctypelen ...       ok ***

Total number of failures: 0
nctest SUCCESS!!!
PASS: nctest
PASS: compare_test_files.sh
=================
All 2 tests passed
=================
make[2]: Leaving directory `/home/auroux/netcdf-3.6.2/nctest'
make[1]: Leaving directory `/home/auroux/netcdf-3.6.2/nctest'
Making check in ncgen
make[1]: Entering directory `/home/auroux/netcdf-3.6.2/ncgen'
/bin/sh ../libtool --tag=CC --mode=link gcc  -g -O2   -o ncgen.exe  main.o 
load.o ncgentab.o escapes.o getfill.o init.o genlib.o ../libsrc/libnetcdf.la 
libtool: link: gcc -g -O2 -o ncgen.exe main.o load.o ncgentab.o escapes.o 
getfill.o init.o genlib.o  ../libsrc/.libs/libnetcdf.a
Info: resolving _opterr by linking to __imp__opterr (auto-import)
Info: resolving _optarg by linking to __imp__optarg (auto-import)
Info: resolving _optind by linking to __imp__optind (auto-import)
make  check-TESTS
make[2]: Entering directory `/home/auroux/netcdf-3.6.2/ncgen'
*** Testing ncgen.
*** creating classic file c0.nc from c0.cdl...
*** creating 64-bit offset file c0_64.nc from c0.cdl...
*** Test successful!
PASS: run_tests.sh
=================
All 1 tests passed
=================
make[2]: Leaving directory `/home/auroux/netcdf-3.6.2/ncgen'
make[1]: Leaving directory `/home/auroux/netcdf-3.6.2/ncgen'
Making check in ncdump
make[1]: Entering directory `/home/auroux/netcdf-3.6.2/ncdump'
/bin/sh ../libtool --tag=CC --mode=link gcc  -g -O2   -o ncdump.exe  ncdump.o 
vardata.o dumplib.o -lm  ../libsrc/libnetcdf.la 
libtool: link: gcc -g -O2 -o ncdump.exe ncdump.o vardata.o dumplib.o  
../libsrc/.libs/libnetcdf.a
Info: resolving _opterr by linking to __imp__opterr (auto-import)
Info: resolving _optind by linking to __imp__optind (auto-import)
Info: resolving _optarg by linking to __imp__optarg (auto-import)
make  rewrite-scalar.exe ctest.exe ctest64.exe ncdump.exe 
make[2]: Entering directory `/home/auroux/netcdf-3.6.2/ncdump'
/bin/sh ../libtool --tag=CC --mode=link gcc  -g -O2   -o rewrite-scalar.exe  
rewrite-scalar.o -lm  ../libsrc/libnetcdf.la 
libtool: link: gcc -g -O2 -o rewrite-scalar.exe rewrite-scalar.o  
../libsrc/.libs/libnetcdf.a
/bin/sh ../libtool --tag=CC --mode=link gcc  -g -O2   -o ctest.exe  ctest.o -lm 
 ../libsrc/libnetcdf.la 
libtool: link: gcc -g -O2 -o ctest.exe ctest.o  ../libsrc/.libs/libnetcdf.a
/bin/sh ../libtool --tag=CC --mode=link gcc  -g -O2   -o ctest64.exe  ctest64.o 
-lm  ../libsrc/libnetcdf.la 
libtool: link: gcc -g -O2 -o ctest64.exe ctest64.o  ../libsrc/.libs/libnetcdf.a
make[2]: `ncdump.exe' is up to date.
make[2]: Leaving directory `/home/auroux/netcdf-3.6.2/ncdump'
make  check-TESTS
make[2]: Entering directory `/home/auroux/netcdf-3.6.2/ncdump'

*** Testing ncgen and ncdump using some test CDL files.
*** creating tst_small.nc from ref_tst_small.cdl...
*** creating tst_small.cdl from tst_small.nc...
*** creating test0.nc from test0.cdl...
*** creating test1.cdl from test0.nc...
*** creating test1.nc from test1.cdl...
*** creating test2.cdl from test1.nc...
*** All tests of ncgen and ncdump using test0.cdl passed!
PASS: run_tests.sh

*** Testing ncgen and ncdump with 64-bit offset format.
*** creating test0.nc from test0.cdl...
*** creating test1.cdl from test0.nc...
*** creating test1.nc from test1.cdl...
*** creating test2.cdl from test1.nc...
*** All ncgen and ncdump with 64-bit offset format tests passed!
PASS: tst_64bit.sh
PASS: ctest
PASS: ctest64

*** Testing ncgen and ncdump test output for classic format.
*** creating ctest1.cdl from ctest0.nc...
*** creating c0.nc from c0.cdl...
*** creating c1.cdl from c0.nc...
*** comparing ncdump of C program output (ctest1.cdl) with c1.cdl...
*** test output for ncdump -k
*** All ncgen and ncdump test output for classic format passed!
*** Testing ncgen and ncdump test output for 64-bit offset format.
*** creating ctest1.cdl from test0_64.nc...
*** creating c0.nc from c0.cdl...
*** creating c1.cdl from c0.nc...
*** comparing ncdump of C program output (ctest1_64.cdl) with c1.cdl...
*** test output for ncdump -k
*** All ncgen and ncdump test output for 64-bit offset format passed!
PASS: tst_output.sh
*** testing length of classic file
*** testing length of classic file written with NOFILL
*** testing length of rewritten classic file
*** testing length of rewritten classic file written with NOFILL
*** testing length of 64-bit offset file
*** testing length of 64-bit offset file written with NOFILL
*** testing length of rewritten 64-bit offset file
*** testing length of rewritten 64-bit offset file written with NOFILL
*** testing length of one-record-variable classic file
*** testing length of one-record-variable classic file written with NOFILL
*** testing length of one-record-variable 64-bit offset file
*** testing length of one-record-variable 64-bit offset file written with NOFILL
PASS: tst_lengths.sh
=================
All 6 tests passed
=================
make[2]: Leaving directory `/home/auroux/netcdf-3.6.2/ncdump'
make[1]: Leaving directory `/home/auroux/netcdf-3.6.2/ncdump'
Making check in nf_test
make[1]: Entering directory `/home/auroux/netcdf-3.6.2/nf_test'
make  nf_test.exe tst_f77_v2.exe   ftest.exe 
make[2]: Entering directory `/home/auroux/netcdf-3.6.2/nf_test'
depbase=`echo fortlib.o | sed 's|[^/]*$|.deps/&|;s|\.o$||'`; \
        if gcc -DHAVE_CONFIG_H -I. -I. -I.. -I../fortran   -Df2cFortran  -g -O2 
-MT fortlib.o -MD -MP -MF "$depbase.Tpo" -c -o fortlib.o fortlib.c; \
        then mv -f "$depbase.Tpo" "$depbase.Po"; else rm -f "$depbase.Tpo"; 
exit 1; fi
/bin/sh ../libtool --tag=F77 --mode=link g77   -I../libsrc  -Wno-globals   -o 
nf_test.exe  test_get.o test_put.o nf_error.o nf_test.o test_read.o 
test_write.o util.o fortlib.o   ../libsrc/libnetcdf.la  
libtool: link: g77 -I../libsrc -Wno-globals -o nf_test.exe test_get.o 
test_put.o nf_error.o nf_test.o test_read.o test_write.o util.o fortlib.o  
../libsrc/.libs/libnetcdf.a
test_get.o: In function `test_nf_get_att_double_':
/home/auroux/netcdf-3.6.2/nf_test/test_get.F:5511: undefined reference to 
`_nf_open_'
/home/auroux/netcdf-3.6.2/nf_test/test_get.F:5521: undefined reference to 
`_nf_get_att_double_'
/home/auroux/netcdf-3.6.2/nf_test/test_get.F:5526: undefined reference to 
`_nf_get_att_double_'
/home/auroux/netcdf-3.6.2/nf_test/test_get.F:5529: undefined reference to 
`_nf_get_att_double_'
/home/auroux/netcdf-3.6.2/nf_test/test_get.F:5547: undefined reference to 
`_nf_get_att_double_'
/home/auroux/netcdf-3.6.2/nf_test/test_get.F:5594: undefined reference to 
`_nf_close_'
test_get.o: In function `test_nf_get_att_real_':
/home/auroux/netcdf-3.6.2/nf_test/test_get.F:5403: undefined reference to 
`_nf_open_'
/home/auroux/netcdf-3.6.2/nf_test/test_get.F:5413: undefined reference to 
`_nf_get_att_real_'
/home/auroux/netcdf-3.6.2/nf_test/test_get.F:5418: undefined reference to 
`_nf_get_att_real_'
/home/auroux/netcdf-3.6.2/nf_test/test_get.F:5421: undefined reference to 
`_nf_get_att_real_'
/home/auroux/netcdf-3.6.2/nf_test/test_get.F:5439: undefined reference to 
`_nf_get_att_real_'
/home/auroux/netcdf-3.6.2/nf_test/test_get.F:5486: undefined reference to 
`_nf_close_'
test_get.o: In function `test_nf_get_att_int_':
/home/auroux/netcdf-3.6.2/nf_test/test_get.F:5295: undefined reference to 
`_nf_open_'
/home/auroux/netcdf-3.6.2/nf_test/test_get.F:5305: undefined reference to 
`_nf_get_att_int_'
/home/auroux/netcdf-3.6.2/nf_test/test_get.F:5310: undefined reference to 
`_nf_get_att_int_'
/home/auroux/netcdf-3.6.2/nf_test/test_get.F:5313: undefined reference to 
`_nf_get_att_int_'
/home/auroux/netcdf-3.6.2/nf_test/test_get.F:5331: undefined reference to 
`_nf_get_att_int_'
/home/auroux/netcdf-3.6.2/nf_test/test_get.F:5378: undefined reference to 
`_nf_close_'
test_get.o: In function `test_nf_get_att_int2_':
/home/auroux/netcdf-3.6.2/nf_test/test_get.F:5186: undefined reference to 
`_nf_open_'
/home/auroux/netcdf-3.6.2/nf_test/test_get.F:5196: undefined reference to 
`_nf_get_att_int2_'
/home/auroux/netcdf-3.6.2/nf_test/test_get.F:5201: undefined reference to 
`_nf_get_att_int2_'
/home/auroux/netcdf-3.6.2/nf_test/test_get.F:5204: undefined reference to 
`_nf_get_att_int2_'
/home/auroux/netcdf-3.6.2/nf_test/test_get.F:5222: undefined reference to 
`_nf_get_att_int2_'
/home/auroux/netcdf-3.6.2/nf_test/test_get.F:5269: undefined reference to 
`_nf_close_'
test_get.o: In function `test_nf_get_att_int1_':
/home/auroux/netcdf-3.6.2/nf_test/test_get.F:5076: undefined reference to 
`_nf_open_'
/home/auroux/netcdf-3.6.2/nf_test/test_get.F:5086: undefined reference to 
`_nf_get_att_int1_'
/home/auroux/netcdf-3.6.2/nf_test/test_get.F:5091: undefined reference to 
`_nf_get_att_int1_'
/home/auroux/netcdf-3.6.2/nf_test/test_get.F:5094: undefined reference to 
`_nf_get_att_int1_'
/home/auroux/netcdf-3.6.2/nf_test/test_get.F:5112: undefined reference to 
`_nf_get_att_int1_'
/home/auroux/netcdf-3.6.2/nf_test/test_get.F:5159: undefined reference to 
`_nf_close_'
test_get.o: In function `test_nf_get_att_text_':
/home/auroux/netcdf-3.6.2/nf_test/test_get.F:4967: undefined reference to 
`_nf_open_'
/home/auroux/netcdf-3.6.2/nf_test/test_get.F:4977: undefined reference to 
`_nf_get_att_text_'
/home/auroux/netcdf-3.6.2/nf_test/test_get.F:4982: undefined reference to 
`_nf_get_att_text_'
/home/auroux/netcdf-3.6.2/nf_test/test_get.F:4985: undefined reference to 
`_nf_get_att_text_'
/home/auroux/netcdf-3.6.2/nf_test/test_get.F:5003: undefined reference to 
`_nf_get_att_text_'
/home/auroux/netcdf-3.6.2/nf_test/test_get.F:5050: undefined reference to 
`_nf_close_'
test_get.o: In function `test_nf_get_varm_double_':
/home/auroux/netcdf-3.6.2/nf_test/test_get.F:4752: undefined reference to 
`_nf_open_'
/home/auroux/netcdf-3.6.2/nf_test/test_get.F:4768: undefined reference to 
`_nf_get_varm_double_'
/home/auroux/netcdf-3.6.2/nf_test/test_get.F:4773: undefined reference to 
`_nf_get_varm_double_'
/home/auroux/netcdf-3.6.2/nf_test/test_get.F:4792: undefined reference to 
`_nf_get_varm_double_'
/home/auroux/netcdf-3.6.2/nf_test/test_get.F:4804: undefined reference to 
`_nf_get_varm_double_'
/home/auroux/netcdf-3.6.2/nf_test/test_get.F:4780: undefined reference to 
`_nf_get_varm_double_'
test_get.o:/home/auroux/netcdf-3.6.2/nf_test/test_get.F:4792: more undefined 
references to `_nf_get_varm_double_' follow
test_get.o: In function `test_nf_get_varm_double_':
/home/auroux/netcdf-3.6.2/nf_test/test_get.F:4941: undefined reference to 
`_nf_close_'
/home/auroux/netcdf-3.6.2/nf_test/test_get.F:4898: undefined reference to 
`_nf_strerror_'
/home/auroux/netcdf-3.6.2/nf_test/test_get.F:4759: undefined reference to 
`__gfortran_stop_string'
test_get.o: In function `test_nf_get_varm_real_':
/home/auroux/netcdf-3.6.2/nf_test/test_get.F:4524: undefined reference to 
`_nf_open_'
/home/auroux/netcdf-3.6.2/nf_test/test_get.F:4540: undefined reference to 
`_nf_get_varm_real_'
/home/auroux/netcdf-3.6.2/nf_test/test_get.F:4545: undefined reference to 
`_nf_get_varm_real_'
/home/auroux/netcdf-3.6.2/nf_test/test_get.F:4564: undefined reference to 
`_nf_get_varm_real_'
/home/auroux/netcdf-3.6.2/nf_test/test_get.F:4576: undefined reference to 
`_nf_get_varm_real_'
/home/auroux/netcdf-3.6.2/nf_test/test_get.F:4552: undefined reference to 
`_nf_get_varm_real_'
test_get.o:/home/auroux/netcdf-3.6.2/nf_test/test_get.F:4564: more undefined 
references to `_nf_get_varm_real_' follow
test_get.o: In function `test_nf_get_varm_real_':
/home/auroux/netcdf-3.6.2/nf_test/test_get.F:4713: undefined reference to 
`_nf_close_'
/home/auroux/netcdf-3.6.2/nf_test/test_get.F:4670: undefined reference to 
`_nf_strerror_'
/home/auroux/netcdf-3.6.2/nf_test/test_get.F:4531: undefined reference to 
`__gfortran_stop_string'
test_get.o: In function `test_nf_get_varm_int_':
/home/auroux/netcdf-3.6.2/nf_test/test_get.F:4296: undefined reference to 
`_nf_open_'
/home/auroux/netcdf-3.6.2/nf_test/test_get.F:4312: undefined reference to 
`_nf_get_varm_int_'
/home/auroux/netcdf-3.6.2/nf_test/test_get.F:4317: undefined reference to 
`_nf_get_varm_int_'
/home/auroux/netcdf-3.6.2/nf_test/test_get.F:4336: undefined reference to 
`_nf_get_varm_int_'
/home/auroux/netcdf-3.6.2/nf_test/test_get.F:4348: undefined reference to 
`_nf_get_varm_int_'
/home/auroux/netcdf-3.6.2/nf_test/test_get.F:4324: undefined reference to 
`_nf_get_varm_int_'
test_get.o:/home/auroux/netcdf-3.6.2/nf_test/test_get.F:4336: more undefined 
references to `_nf_get_varm_int_' follow
test_get.o: In function `test_nf_get_varm_int_':
/home/auroux/netcdf-3.6.2/nf_test/test_get.F:4485: undefined reference to 
`_nf_close_'
/home/auroux/netcdf-3.6.2/nf_test/test_get.F:4442: undefined reference to 
`_nf_strerror_'
/home/auroux/netcdf-3.6.2/nf_test/test_get.F:4303: undefined reference to 
`__gfortran_stop_string'
test_get.o: In function `test_nf_get_varm_int2_':
/home/auroux/netcdf-3.6.2/nf_test/test_get.F:4067: undefined reference to 
`_nf_open_'
/home/auroux/netcdf-3.6.2/nf_test/test_get.F:4083: undefined reference to 
`_nf_get_varm_int2_'
/home/auroux/netcdf-3.6.2/nf_test/test_get.F:4088: undefined reference to 
`_nf_get_varm_int2_'
/home/auroux/netcdf-3.6.2/nf_test/test_get.F:4107: undefined reference to 
`_nf_get_varm_int2_'
/home/auroux/netcdf-3.6.2/nf_test/test_get.F:4119: undefined reference to 
`_nf_get_varm_int2_'
/home/auroux/netcdf-3.6.2/nf_test/test_get.F:4095: undefined reference to 
`_nf_get_varm_int2_'
test_get.o:/home/auroux/netcdf-3.6.2/nf_test/test_get.F:4107: more undefined 
references to `_nf_get_varm_int2_' follow
test_get.o: In function `test_nf_get_varm_int2_':
/home/auroux/netcdf-3.6.2/nf_test/test_get.F:4256: undefined reference to 
`_nf_close_'
/home/auroux/netcdf-3.6.2/nf_test/test_get.F:4213: undefined reference to 
`_nf_strerror_'
/home/auroux/netcdf-3.6.2/nf_test/test_get.F:4074: undefined reference to 
`__gfortran_stop_string'
test_get.o: In function `test_nf_get_varm_int1_':
/home/auroux/netcdf-3.6.2/nf_test/test_get.F:3837: undefined reference to 
`_nf_open_'
/home/auroux/netcdf-3.6.2/nf_test/test_get.F:3853: undefined reference to 
`_nf_get_varm_int1_'
/home/auroux/netcdf-3.6.2/nf_test/test_get.F:3858: undefined reference to 
`_nf_get_varm_int1_'
/home/auroux/netcdf-3.6.2/nf_test/test_get.F:3877: undefined reference to 
`_nf_get_varm_int1_'
/home/auroux/netcdf-3.6.2/nf_test/test_get.F:3889: undefined reference to 
`_nf_get_varm_int1_'
/home/auroux/netcdf-3.6.2/nf_test/test_get.F:3865: undefined reference to 
`_nf_get_varm_int1_'
test_get.o:/home/auroux/netcdf-3.6.2/nf_test/test_get.F:3877: more undefined 
references to `_nf_get_varm_int1_' follow
test_get.o: In function `test_nf_get_varm_int1_':
/home/auroux/netcdf-3.6.2/nf_test/test_get.F:4026: undefined reference to 
`_nf_close_'
/home/auroux/netcdf-3.6.2/nf_test/test_get.F:3983: undefined reference to 
`_nf_strerror_'
/home/auroux/netcdf-3.6.2/nf_test/test_get.F:3844: undefined reference to 
`__gfortran_stop_string'
test_get.o: In function `test_nf_get_varm_text_':
/home/auroux/netcdf-3.6.2/nf_test/test_get.F:3608: undefined reference to 
`_nf_open_'
/home/auroux/netcdf-3.6.2/nf_test/test_get.F:3624: undefined reference to 
`_nf_get_varm_text_'
/home/auroux/netcdf-3.6.2/nf_test/test_get.F:3629: undefined reference to 
`_nf_get_varm_text_'
/home/auroux/netcdf-3.6.2/nf_test/test_get.F:3648: undefined reference to 
`_nf_get_varm_text_'
/home/auroux/netcdf-3.6.2/nf_test/test_get.F:3660: undefined reference to 
`_nf_get_varm_text_'
/home/auroux/netcdf-3.6.2/nf_test/test_get.F:3636: undefined reference to 
`_nf_get_varm_text_'
test_get.o:/home/auroux/netcdf-3.6.2/nf_test/test_get.F:3648: more undefined 
references to `_nf_get_varm_text_' follow
test_get.o: In function `test_nf_get_varm_text_':
/home/auroux/netcdf-3.6.2/nf_test/test_get.F:3797: undefined reference to 
`_nf_close_'
/home/auroux/netcdf-3.6.2/nf_test/test_get.F:3754: undefined reference to 
`_nf_strerror_'
/home/auroux/netcdf-3.6.2/nf_test/test_get.F:3615: undefined reference to 
`__gfortran_stop_string'
test_get.o: In function `test_nf_get_vars_double_':
/home/auroux/netcdf-3.6.2/nf_test/test_get.F:3388: undefined reference to 
`_nf_open_'
/home/auroux/netcdf-3.6.2/nf_test/test_get.F:3402: undefined reference to 
`_nf_get_vars_double_'
/home/auroux/netcdf-3.6.2/nf_test/test_get.F:3407: undefined reference to 
`_nf_get_vars_double_'
/home/auroux/netcdf-3.6.2/nf_test/test_get.F:3426: undefined reference to 
`_nf_get_vars_double_'
/home/auroux/netcdf-3.6.2/nf_test/test_get.F:3438: undefined reference to 
`_nf_get_vars_double_'
/home/auroux/netcdf-3.6.2/nf_test/test_get.F:3414: undefined reference to 
`_nf_get_vars_double_'
test_get.o:/home/auroux/netcdf-3.6.2/nf_test/test_get.F:3426: more undefined 
references to `_nf_get_vars_double_' follow
test_get.o: In function `test_nf_get_vars_double_':
/home/auroux/netcdf-3.6.2/nf_test/test_get.F:3568: undefined reference to 
`_nf_close_'
/home/auroux/netcdf-3.6.2/nf_test/test_get.F:3525: undefined reference to 
`_nf_strerror_'
/home/auroux/netcdf-3.6.2/nf_test/test_get.F:3395: undefined reference to 
`__gfortran_stop_string'
test_get.o: In function `test_nf_get_vars_real_':
/home/auroux/netcdf-3.6.2/nf_test/test_get.F:3170: undefined reference to 
`_nf_open_'
/home/auroux/netcdf-3.6.2/nf_test/test_get.F:3184: undefined reference to 
`_nf_get_vars_real_'
/home/auroux/netcdf-3.6.2/nf_test/test_get.F:3189: undefined reference to 
`_nf_get_vars_real_'
/home/auroux/netcdf-3.6.2/nf_test/test_get.F:3208: undefined reference to 
`_nf_get_vars_real_'
/home/auroux/netcdf-3.6.2/nf_test/test_get.F:3220: undefined reference to 
`_nf_get_vars_real_'
/home/auroux/netcdf-3.6.2/nf_test/test_get.F:3196: undefined reference to 
`_nf_get_vars_real_'
test_get.o:/home/auroux/netcdf-3.6.2/nf_test/test_get.F:3208: more undefined 
references to `_nf_get_vars_real_' follow
test_get.o: In function `test_nf_get_vars_real_':
/home/auroux/netcdf-3.6.2/nf_test/test_get.F:3350: undefined reference to 
`_nf_close_'
/home/auroux/netcdf-3.6.2/nf_test/test_get.F:3307: undefined reference to 
`_nf_strerror_'
/home/auroux/netcdf-3.6.2/nf_test/test_get.F:3177: undefined reference to 
`__gfortran_stop_string'
test_get.o: In function `test_nf_get_vars_int_':
/home/auroux/netcdf-3.6.2/nf_test/test_get.F:2952: undefined reference to 
`_nf_open_'
/home/auroux/netcdf-3.6.2/nf_test/test_get.F:2966: undefined reference to 
`_nf_get_vars_int_'
/home/auroux/netcdf-3.6.2/nf_test/test_get.F:2971: undefined reference to 
`_nf_get_vars_int_'
/home/auroux/netcdf-3.6.2/nf_test/test_get.F:2990: undefined reference to 
`_nf_get_vars_int_'
/home/auroux/netcdf-3.6.2/nf_test/test_get.F:3002: undefined reference to 
`_nf_get_vars_int_'
/home/auroux/netcdf-3.6.2/nf_test/test_get.F:2978: undefined reference to 
`_nf_get_vars_int_'
test_get.o:/home/auroux/netcdf-3.6.2/nf_test/test_get.F:2990: more undefined 
references to `_nf_get_vars_int_' follow
test_get.o: In function `test_nf_get_vars_int_':
/home/auroux/netcdf-3.6.2/nf_test/test_get.F:3132: undefined reference to 
`_nf_close_'
/home/auroux/netcdf-3.6.2/nf_test/test_get.F:3089: undefined reference to 
`_nf_strerror_'
/home/auroux/netcdf-3.6.2/nf_test/test_get.F:2959: undefined reference to 
`__gfortran_stop_string'
test_get.o: In function `test_nf_get_vars_int2_':
/home/auroux/netcdf-3.6.2/nf_test/test_get.F:2733: undefined reference to 
`_nf_open_'
/home/auroux/netcdf-3.6.2/nf_test/test_get.F:2747: undefined reference to 
`_nf_get_vars_int2_'
/home/auroux/netcdf-3.6.2/nf_test/test_get.F:2752: undefined reference to 
`_nf_get_vars_int2_'
/home/auroux/netcdf-3.6.2/nf_test/test_get.F:2771: undefined reference to 
`_nf_get_vars_int2_'
/home/auroux/netcdf-3.6.2/nf_test/test_get.F:2783: undefined reference to 
`_nf_get_vars_int2_'
/home/auroux/netcdf-3.6.2/nf_test/test_get.F:2759: undefined reference to 
`_nf_get_vars_int2_'
test_get.o:/home/auroux/netcdf-3.6.2/nf_test/test_get.F:2771: more undefined 
references to `_nf_get_vars_int2_' follow
test_get.o: In function `test_nf_get_vars_int2_':
/home/auroux/netcdf-3.6.2/nf_test/test_get.F:2913: undefined reference to 
`_nf_close_'
/home/auroux/netcdf-3.6.2/nf_test/test_get.F:2870: undefined reference to 
`_nf_strerror_'
/home/auroux/netcdf-3.6.2/nf_test/test_get.F:2740: undefined reference to 
`__gfortran_stop_string'
test_get.o: In function `test_nf_get_vars_int1_':
/home/auroux/netcdf-3.6.2/nf_test/test_get.F:2513: undefined reference to 
`_nf_open_'
/home/auroux/netcdf-3.6.2/nf_test/test_get.F:2527: undefined reference to 
`_nf_get_vars_int1_'
/home/auroux/netcdf-3.6.2/nf_test/test_get.F:2532: undefined reference to 
`_nf_get_vars_int1_'
/home/auroux/netcdf-3.6.2/nf_test/test_get.F:2551: undefined reference to 
`_nf_get_vars_int1_'
/home/auroux/netcdf-3.6.2/nf_test/test_get.F:2563: undefined reference to 
`_nf_get_vars_int1_'
/home/auroux/netcdf-3.6.2/nf_test/test_get.F:2539: undefined reference to 
`_nf_get_vars_int1_'
test_get.o:/home/auroux/netcdf-3.6.2/nf_test/test_get.F:2551: more undefined 
references to `_nf_get_vars_int1_' follow
test_get.o: In function `test_nf_get_vars_int1_':
/home/auroux/netcdf-3.6.2/nf_test/test_get.F:2693: undefined reference to 
`_nf_close_'
/home/auroux/netcdf-3.6.2/nf_test/test_get.F:2650: undefined reference to 
`_nf_strerror_'
/home/auroux/netcdf-3.6.2/nf_test/test_get.F:2520: undefined reference to 
`__gfortran_stop_string'
test_get.o: In function `test_nf_get_vars_text_':
/home/auroux/netcdf-3.6.2/nf_test/test_get.F:2294: undefined reference to 
`_nf_open_'
/home/auroux/netcdf-3.6.2/nf_test/test_get.F:2308: undefined reference to 
`_nf_get_vars_text_'
/home/auroux/netcdf-3.6.2/nf_test/test_get.F:2313: undefined reference to 
`_nf_get_vars_text_'
/home/auroux/netcdf-3.6.2/nf_test/test_get.F:2332: undefined reference to 
`_nf_get_vars_text_'
/home/auroux/netcdf-3.6.2/nf_test/test_get.F:2344: undefined reference to 
`_nf_get_vars_text_'
/home/auroux/netcdf-3.6.2/nf_test/test_get.F:2320: undefined reference to 
`_nf_get_vars_text_'
test_get.o:/home/auroux/netcdf-3.6.2/nf_test/test_get.F:2332: more undefined 
references to `_nf_get_vars_text_' follow
test_get.o: In function `test_nf_get_vars_text_':
/home/auroux/netcdf-3.6.2/nf_test/test_get.F:2474: undefined reference to 
`_nf_close_'
/home/auroux/netcdf-3.6.2/nf_test/test_get.F:2431: undefined reference to 
`_nf_strerror_'
/home/auroux/netcdf-3.6.2/nf_test/test_get.F:2301: undefined reference to 
`__gfortran_stop_string'
test_get.o: In function `test_nf_get_vara_double_':
/home/auroux/netcdf-3.6.2/nf_test/test_get.F:2095: undefined reference to 
`_nf_open_'
/home/auroux/netcdf-3.6.2/nf_test/test_get.F:2108: undefined reference to 
`_nf_get_vara_double_'
/home/auroux/netcdf-3.6.2/nf_test/test_get.F:2112: undefined reference to 
`_nf_get_vara_double_'
/home/auroux/netcdf-3.6.2/nf_test/test_get.F:2124: undefined reference to 
`_nf_get_vara_double_'
/home/auroux/netcdf-3.6.2/nf_test/test_get.F:2118: undefined reference to 
`_nf_get_vara_double_'
/home/auroux/netcdf-3.6.2/nf_test/test_get.F:2124: undefined reference to 
`_nf_get_vara_double_'
test_get.o:/home/auroux/netcdf-3.6.2/nf_test/test_get.F:2209: more undefined 
references to `_nf_get_vara_double_' follow
test_get.o: In function `test_nf_get_vara_double_':
/home/auroux/netcdf-3.6.2/nf_test/test_get.F:2255: undefined reference to 
`_nf_close_'
/home/auroux/netcdf-3.6.2/nf_test/test_get.F:2257: undefined reference to 
`_nf_strerror_'
/home/auroux/netcdf-3.6.2/nf_test/test_get.F:2124: undefined reference to 
`_nf_get_vara_double_'
/home/auroux/netcdf-3.6.2/nf_test/test_get.F:2137: undefined reference to 
`_nf_get_vara_double_'
/home/auroux/netcdf-3.6.2/nf_test/test_get.F:2141: undefined reference to 
`_nf_get_vara_double_'
/home/auroux/netcdf-3.6.2/nf_test/test_get.F:2155: undefined reference to 
`_nf_get_vara_double_'
/home/auroux/netcdf-3.6.2/nf_test/test_get.F:2148: undefined reference to 
`_nf_get_vara_double_'
/home/auroux/netcdf-3.6.2/nf_test/test_get.F:2158: undefined reference to 
`_nf_strerror_'
/home/auroux/netcdf-3.6.2/nf_test/test_get.F:2102: undefined reference to 
`__gfortran_stop_string'
test_get.o: In function `test_nf_get_vara_real_':
/home/auroux/netcdf-3.6.2/nf_test/test_get.F:1903: undefined reference to 
`_nf_open_'
/home/auroux/netcdf-3.6.2/nf_test/test_get.F:1916: undefined reference to 
`_nf_get_vara_real_'
/home/auroux/netcdf-3.6.2/nf_test/test_get.F:1920: undefined reference to 
`_nf_get_vara_real_'
/home/auroux/netcdf-3.6.2/nf_test/test_get.F:1932: undefined reference to 
`_nf_get_vara_real_'
/home/auroux/netcdf-3.6.2/nf_test/test_get.F:1926: undefined reference to 
`_nf_get_vara_real_'
/home/auroux/netcdf-3.6.2/nf_test/test_get.F:1932: undefined reference to 
`_nf_get_vara_real_'
test_get.o:/home/auroux/netcdf-3.6.2/nf_test/test_get.F:2017: more undefined 
references to `_nf_get_vara_real_' follow
test_get.o: In function `test_nf_get_vara_real_':
/home/auroux/netcdf-3.6.2/nf_test/test_get.F:2063: undefined reference to 
`_nf_close_'
/home/auroux/netcdf-3.6.2/nf_test/test_get.F:2065: undefined reference to 
`_nf_strerror_'
/home/auroux/netcdf-3.6.2/nf_test/test_get.F:1932: undefined reference to 
`_nf_get_vara_real_'
/home/auroux/netcdf-3.6.2/nf_test/test_get.F:1945: undefined reference to 
`_nf_get_vara_real_'
/home/auroux/netcdf-3.6.2/nf_test/test_get.F:1949: undefined reference to 
`_nf_get_vara_real_'
/home/auroux/netcdf-3.6.2/nf_test/test_get.F:1963: undefined reference to 
`_nf_get_vara_real_'
/home/auroux/netcdf-3.6.2/nf_test/test_get.F:1956: undefined reference to 
`_nf_get_vara_real_'
/home/auroux/netcdf-3.6.2/nf_test/test_get.F:1966: undefined reference to 
`_nf_strerror_'
/home/auroux/netcdf-3.6.2/nf_test/test_get.F:1910: undefined reference to 
`__gfortran_stop_string'
test_get.o: In function `test_nf_get_vara_int_':
/home/auroux/netcdf-3.6.2/nf_test/test_get.F:1711: undefined reference to 
`_nf_open_'
/home/auroux/netcdf-3.6.2/nf_test/test_get.F:1724: undefined reference to 
`_nf_get_vara_int_'
/home/auroux/netcdf-3.6.2/nf_test/test_get.F:1728: undefined reference to 
`_nf_get_vara_int_'
/home/auroux/netcdf-3.6.2/nf_test/test_get.F:1740: undefined reference to 
`_nf_get_vara_int_'
/home/auroux/netcdf-3.6.2/nf_test/test_get.F:1734: undefined reference to 
`_nf_get_vara_int_'
/home/auroux/netcdf-3.6.2/nf_test/test_get.F:1740: undefined reference to 
`_nf_get_vara_int_'
test_get.o:/home/auroux/netcdf-3.6.2/nf_test/test_get.F:1825: more undefined 
references to `_nf_get_vara_int_' follow
test_get.o: In function `test_nf_get_vara_int_':
/home/auroux/netcdf-3.6.2/nf_test/test_get.F:1871: undefined reference to 
`_nf_close_'
/home/auroux/netcdf-3.6.2/nf_test/test_get.F:1873: undefined reference to 
`_nf_strerror_'
/home/auroux/netcdf-3.6.2/nf_test/test_get.F:1740: undefined reference to 
`_nf_get_vara_int_'
/home/auroux/netcdf-3.6.2/nf_test/test_get.F:1753: undefined reference to 
`_nf_get_vara_int_'
/home/auroux/netcdf-3.6.2/nf_test/test_get.F:1757: undefined reference to 
`_nf_get_vara_int_'
/home/auroux/netcdf-3.6.2/nf_test/test_get.F:1771: undefined reference to 
`_nf_get_vara_int_'
/home/auroux/netcdf-3.6.2/nf_test/test_get.F:1764: undefined reference to 
`_nf_get_vara_int_'
/home/auroux/netcdf-3.6.2/nf_test/test_get.F:1774: undefined reference to 
`_nf_strerror_'
/home/auroux/netcdf-3.6.2/nf_test/test_get.F:1718: undefined reference to 
`__gfortran_stop_string'
test_get.o: In function `test_nf_get_vara_int2_':
/home/auroux/netcdf-3.6.2/nf_test/test_get.F:1518: undefined reference to 
`_nf_open_'
/home/auroux/netcdf-3.6.2/nf_test/test_get.F:1531: undefined reference to 
`_nf_get_vara_int2_'
/home/auroux/netcdf-3.6.2/nf_test/test_get.F:1535: undefined reference to 
`_nf_get_vara_int2_'
/home/auroux/netcdf-3.6.2/nf_test/test_get.F:1547: undefined reference to 
`_nf_get_vara_int2_'
/home/auroux/netcdf-3.6.2/nf_test/test_get.F:1541: undefined reference to 
`_nf_get_vara_int2_'
/home/auroux/netcdf-3.6.2/nf_test/test_get.F:1547: undefined reference to 
`_nf_get_vara_int2_'
test_get.o:/home/auroux/netcdf-3.6.2/nf_test/test_get.F:1632: more undefined 
references to `_nf_get_vara_int2_' follow
test_get.o: In function `test_nf_get_vara_int2_':
/home/auroux/netcdf-3.6.2/nf_test/test_get.F:1678: undefined reference to 
`_nf_close_'
/home/auroux/netcdf-3.6.2/nf_test/test_get.F:1680: undefined reference to 
`_nf_strerror_'
/home/auroux/netcdf-3.6.2/nf_test/test_get.F:1547: undefined reference to 
`_nf_get_vara_int2_'
/home/auroux/netcdf-3.6.2/nf_test/test_get.F:1560: undefined reference to 
`_nf_get_vara_int2_'
/home/auroux/netcdf-3.6.2/nf_test/test_get.F:1564: undefined reference to 
`_nf_get_vara_int2_'
/home/auroux/netcdf-3.6.2/nf_test/test_get.F:1578: undefined reference to 
`_nf_get_vara_int2_'
/home/auroux/netcdf-3.6.2/nf_test/test_get.F:1571: undefined reference to 
`_nf_get_vara_int2_'
/home/auroux/netcdf-3.6.2/nf_test/test_get.F:1581: undefined reference to 
`_nf_strerror_'
/home/auroux/netcdf-3.6.2/nf_test/test_get.F:1525: undefined reference to 
`__gfortran_stop_string'
test_get.o: In function `test_nf_get_vara_int1_':
/home/auroux/netcdf-3.6.2/nf_test/test_get.F:1324: undefined reference to 
`_nf_open_'
/home/auroux/netcdf-3.6.2/nf_test/test_get.F:1337: undefined reference to 
`_nf_get_vara_int1_'
/home/auroux/netcdf-3.6.2/nf_test/test_get.F:1341: undefined reference to 
`_nf_get_vara_int1_'
/home/auroux/netcdf-3.6.2/nf_test/test_get.F:1353: undefined reference to 
`_nf_get_vara_int1_'
/home/auroux/netcdf-3.6.2/nf_test/test_get.F:1347: undefined reference to 
`_nf_get_vara_int1_'
/home/auroux/netcdf-3.6.2/nf_test/test_get.F:1353: undefined reference to 
`_nf_get_vara_int1_'
test_get.o:/home/auroux/netcdf-3.6.2/nf_test/test_get.F:1438: more undefined 
references to `_nf_get_vara_int1_' follow
test_get.o: In function `test_nf_get_vara_int1_':
/home/auroux/netcdf-3.6.2/nf_test/test_get.F:1484: undefined reference to 
`_nf_close_'
/home/auroux/netcdf-3.6.2/nf_test/test_get.F:1486: undefined reference to 
`_nf_strerror_'
/home/auroux/netcdf-3.6.2/nf_test/test_get.F:1353: undefined reference to 
`_nf_get_vara_int1_'
/home/auroux/netcdf-3.6.2/nf_test/test_get.F:1366: undefined reference to 
`_nf_get_vara_int1_'
/home/auroux/netcdf-3.6.2/nf_test/test_get.F:1370: undefined reference to 
`_nf_get_vara_int1_'
/home/auroux/netcdf-3.6.2/nf_test/test_get.F:1384: undefined reference to 
`_nf_get_vara_int1_'
/home/auroux/netcdf-3.6.2/nf_test/test_get.F:1377: undefined reference to 
`_nf_get_vara_int1_'
/home/auroux/netcdf-3.6.2/nf_test/test_get.F:1387: undefined reference to 
`_nf_strerror_'
/home/auroux/netcdf-3.6.2/nf_test/test_get.F:1331: undefined reference to 
`__gfortran_stop_string'
test_get.o: In function `test_nf_get_vara_text_':
/home/auroux/netcdf-3.6.2/nf_test/test_get.F:1131: undefined reference to 
`_nf_open_'
/home/auroux/netcdf-3.6.2/nf_test/test_get.F:1144: undefined reference to 
`_nf_get_vara_text_'
/home/auroux/netcdf-3.6.2/nf_test/test_get.F:1148: undefined reference to 
`_nf_get_vara_text_'
/home/auroux/netcdf-3.6.2/nf_test/test_get.F:1160: undefined reference to 
`_nf_get_vara_text_'
/home/auroux/netcdf-3.6.2/nf_test/test_get.F:1154: undefined reference to 
`_nf_get_vara_text_'
/home/auroux/netcdf-3.6.2/nf_test/test_get.F:1160: undefined reference to 
`_nf_get_vara_text_'
test_get.o:/home/auroux/netcdf-3.6.2/nf_test/test_get.F:1245: more undefined 
references to `_nf_get_vara_text_' follow
test_get.o: In function `test_nf_get_vara_text_':
/home/auroux/netcdf-3.6.2/nf_test/test_get.F:1291: undefined reference to 
`_nf_close_'
/home/auroux/netcdf-3.6.2/nf_test/test_get.F:1293: undefined reference to 
`_nf_strerror_'
/home/auroux/netcdf-3.6.2/nf_test/test_get.F:1160: undefined reference to 
`_nf_get_vara_text_'
/home/auroux/netcdf-3.6.2/nf_test/test_get.F:1173: undefined reference to 
`_nf_get_vara_text_'
/home/auroux/netcdf-3.6.2/nf_test/test_get.F:1177: undefined reference to 
`_nf_get_vara_text_'
/home/auroux/netcdf-3.6.2/nf_test/test_get.F:1191: undefined reference to 
`_nf_get_vara_text_'
/home/auroux/netcdf-3.6.2/nf_test/test_get.F:1184: undefined reference to 
`_nf_get_vara_text_'
/home/auroux/netcdf-3.6.2/nf_test/test_get.F:1194: undefined reference to 
`_nf_strerror_'
/home/auroux/netcdf-3.6.2/nf_test/test_get.F:1138: undefined reference to 
`__gfortran_stop_string'
test_get.o: In function `test_nf_get_var_double_':
/home/auroux/netcdf-3.6.2/nf_test/test_get.F:1032: undefined reference to 
`_nf_open_'
/home/auroux/netcdf-3.6.2/nf_test/test_get.F:1038: undefined reference to 
`_nf_get_var_double_'
/home/auroux/netcdf-3.6.2/nf_test/test_get.F:1041: undefined reference to 
`_nf_get_var_double_'
/home/auroux/netcdf-3.6.2/nf_test/test_get.F:1064: undefined reference to 
`_nf_get_var_double_'
/home/auroux/netcdf-3.6.2/nf_test/test_get.F:1098: undefined reference to 
`_nf_close_'
test_get.o: In function `test_nf_get_var_real_':
/home/auroux/netcdf-3.6.2/nf_test/test_get.F:941: undefined reference to 
`_nf_open_'
/home/auroux/netcdf-3.6.2/nf_test/test_get.F:947: undefined reference to 
`_nf_get_var_real_'
/home/auroux/netcdf-3.6.2/nf_test/test_get.F:950: undefined reference to 
`_nf_get_var_real_'
/home/auroux/netcdf-3.6.2/nf_test/test_get.F:973: undefined reference to 
`_nf_get_var_real_'
/home/auroux/netcdf-3.6.2/nf_test/test_get.F:1007: undefined reference to 
`_nf_close_'
test_get.o: In function `test_nf_get_var_int_':
/home/auroux/netcdf-3.6.2/nf_test/test_get.F:850: undefined reference to 
`_nf_open_'
/home/auroux/netcdf-3.6.2/nf_test/test_get.F:856: undefined reference to 
`_nf_get_var_int_'
/home/auroux/netcdf-3.6.2/nf_test/test_get.F:859: undefined reference to 
`_nf_get_var_int_'
/home/auroux/netcdf-3.6.2/nf_test/test_get.F:882: undefined reference to 
`_nf_get_var_int_'
/home/auroux/netcdf-3.6.2/nf_test/test_get.F:916: undefined reference to 
`_nf_close_'
test_get.o: In function `test_nf_get_var_int2_':
/home/auroux/netcdf-3.6.2/nf_test/test_get.F:758: undefined reference to 
`_nf_open_'
/home/auroux/netcdf-3.6.2/nf_test/test_get.F:764: undefined reference to 
`_nf_get_var_int2_'
/home/auroux/netcdf-3.6.2/nf_test/test_get.F:767: undefined reference to 
`_nf_get_var_int2_'
/home/auroux/netcdf-3.6.2/nf_test/test_get.F:790: undefined reference to 
`_nf_get_var_int2_'
/home/auroux/netcdf-3.6.2/nf_test/test_get.F:824: undefined reference to 
`_nf_close_'
test_get.o: In function `test_nf_get_var_int1_':
/home/auroux/netcdf-3.6.2/nf_test/test_get.F:665: undefined reference to 
`_nf_open_'
/home/auroux/netcdf-3.6.2/nf_test/test_get.F:671: undefined reference to 
`_nf_get_var_int1_'
/home/auroux/netcdf-3.6.2/nf_test/test_get.F:674: undefined reference to 
`_nf_get_var_int1_'
/home/auroux/netcdf-3.6.2/nf_test/test_get.F:697: undefined reference to 
`_nf_get_var_int1_'
/home/auroux/netcdf-3.6.2/nf_test/test_get.F:731: undefined reference to 
`_nf_close_'
test_get.o: In function `test_nf_get_var_text_':
/home/auroux/netcdf-3.6.2/nf_test/test_get.F:573: undefined reference to 
`_nf_open_'
/home/auroux/netcdf-3.6.2/nf_test/test_get.F:579: undefined reference to 
`_nf_get_var_text_'
/home/auroux/netcdf-3.6.2/nf_test/test_get.F:582: undefined reference to 
`_nf_get_var_text_'
/home/auroux/netcdf-3.6.2/nf_test/test_get.F:605: undefined reference to 
`_nf_get_var_text_'
/home/auroux/netcdf-3.6.2/nf_test/test_get.F:639: undefined reference to 
`_nf_close_'
test_get.o: In function `test_nf_get_var1_double_':
/home/auroux/netcdf-3.6.2/nf_test/test_get.F:479: undefined reference to 
`_nf_open_'
/home/auroux/netcdf-3.6.2/nf_test/test_get.F:488: undefined reference to 
`_nf_get_var1_double_'
/home/auroux/netcdf-3.6.2/nf_test/test_get.F:492: undefined reference to 
`_nf_get_var1_double_'
/home/auroux/netcdf-3.6.2/nf_test/test_get.F:547: undefined reference to 
`_nf_close_'
/home/auroux/netcdf-3.6.2/nf_test/test_get.F:497: undefined reference to 
`_nf_get_var1_double_'
/home/auroux/netcdf-3.6.2/nf_test/test_get.F:515: undefined reference to 
`_nf_get_var1_double_'
test_get.o: In function `test_nf_get_var1_real_':
/home/auroux/netcdf-3.6.2/nf_test/test_get.F:389: undefined reference to 
`_nf_open_'
/home/auroux/netcdf-3.6.2/nf_test/test_get.F:398: undefined reference to 
`_nf_get_var1_real_'
/home/auroux/netcdf-3.6.2/nf_test/test_get.F:402: undefined reference to 
`_nf_get_var1_real_'
/home/auroux/netcdf-3.6.2/nf_test/test_get.F:457: undefined reference to 
`_nf_close_'
/home/auroux/netcdf-3.6.2/nf_test/test_get.F:407: undefined reference to 
`_nf_get_var1_real_'
/home/auroux/netcdf-3.6.2/nf_test/test_get.F:425: undefined reference to 
`_nf_get_var1_real_'
test_get.o: In function `test_nf_get_var1_int_':
/home/auroux/netcdf-3.6.2/nf_test/test_get.F:299: undefined reference to 
`_nf_open_'
/home/auroux/netcdf-3.6.2/nf_test/test_get.F:308: undefined reference to 
`_nf_get_var1_int_'
/home/auroux/netcdf-3.6.2/nf_test/test_get.F:312: undefined reference to 
`_nf_get_var1_int_'
/home/auroux/netcdf-3.6.2/nf_test/test_get.F:367: undefined reference to 
`_nf_close_'
/home/auroux/netcdf-3.6.2/nf_test/test_get.F:317: undefined reference to 
`_nf_get_var1_int_'
/home/auroux/netcdf-3.6.2/nf_test/test_get.F:335: undefined reference to 
`_nf_get_var1_int_'
test_get.o: In function `test_nf_get_var1_int2_':
/home/auroux/netcdf-3.6.2/nf_test/test_get.F:208: undefined reference to 
`_nf_open_'
/home/auroux/netcdf-3.6.2/nf_test/test_get.F:217: undefined reference to 
`_nf_get_var1_int2_'
/home/auroux/netcdf-3.6.2/nf_test/test_get.F:221: undefined reference to 
`_nf_get_var1_int2_'
/home/auroux/netcdf-3.6.2/nf_test/test_get.F:276: undefined reference to 
`_nf_close_'
/home/auroux/netcdf-3.6.2/nf_test/test_get.F:226: undefined reference to 
`_nf_get_var1_int2_'
/home/auroux/netcdf-3.6.2/nf_test/test_get.F:244: undefined reference to 
`_nf_get_var1_int2_'
test_get.o: In function `test_nf_get_var1_int1_':
/home/auroux/netcdf-3.6.2/nf_test/test_get.F:116: undefined reference to 
`_nf_open_'
/home/auroux/netcdf-3.6.2/nf_test/test_get.F:125: undefined reference to 
`_nf_get_var1_int1_'
/home/auroux/netcdf-3.6.2/nf_test/test_get.F:129: undefined reference to 
`_nf_get_var1_int1_'
/home/auroux/netcdf-3.6.2/nf_test/test_get.F:184: undefined reference to 
`_nf_close_'
/home/auroux/netcdf-3.6.2/nf_test/test_get.F:134: undefined reference to 
`_nf_get_var1_int1_'
/home/auroux/netcdf-3.6.2/nf_test/test_get.F:152: undefined reference to 
`_nf_get_var1_int1_'
test_get.o: In function `test_nf_get_var1_text_':
/home/auroux/netcdf-3.6.2/nf_test/test_get.F:25: undefined reference to 
`_nf_open_'
/home/auroux/netcdf-3.6.2/nf_test/test_get.F:34: undefined reference to 
`_nf_get_var1_text_'
/home/auroux/netcdf-3.6.2/nf_test/test_get.F:38: undefined reference to 
`_nf_get_var1_text_'
/home/auroux/netcdf-3.6.2/nf_test/test_get.F:93: undefined reference to 
`_nf_close_'
/home/auroux/netcdf-3.6.2/nf_test/test_get.F:43: undefined reference to 
`_nf_get_var1_text_'
/home/auroux/netcdf-3.6.2/nf_test/test_get.F:61: undefined reference to 
`_nf_get_var1_text_'
test_put.o: In function `test_nf_put_att_double_':
/home/auroux/netcdf-3.6.2/nf_test/test_put.F:6578: undefined reference to 
`_nf_create_'
/home/auroux/netcdf-3.6.2/nf_test/test_put.F:6594: undefined reference to 
`_nf_put_att_double_'
/home/auroux/netcdf-3.6.2/nf_test/test_put.F:6599: undefined reference to 
`_nf_put_att_double_'
/home/auroux/netcdf-3.6.2/nf_test/test_put.F:6604: undefined reference to 
`_nf_put_att_double_'
/home/auroux/netcdf-3.6.2/nf_test/test_put.F:6619: undefined reference to 
`_nf_put_att_double_'
/home/auroux/netcdf-3.6.2/nf_test/test_put.F:6619: undefined reference to 
`_nf_put_att_double_'
/home/auroux/netcdf-3.6.2/nf_test/test_put.F:6622: undefined reference to 
`_nf_strerror_'
/home/auroux/netcdf-3.6.2/nf_test/test_put.F:6632: undefined reference to 
`_nf_close_'
/home/auroux/netcdf-3.6.2/nf_test/test_put.F:6636: undefined reference to 
`_nf_delete_'
/home/auroux/netcdf-3.6.2/nf_test/test_put.F:6590: undefined reference to 
`__gfortran_stop_string'
test_put.o: In function `test_nf_put_att_real_':
/home/auroux/netcdf-3.6.2/nf_test/test_put.F:6501: undefined reference to 
`_nf_create_'
/home/auroux/netcdf-3.6.2/nf_test/test_put.F:6517: undefined reference to 
`_nf_put_att_real_'
/home/auroux/netcdf-3.6.2/nf_test/test_put.F:6522: undefined reference to 
`_nf_put_att_real_'
/home/auroux/netcdf-3.6.2/nf_test/test_put.F:6527: undefined reference to 
`_nf_put_att_real_'
/home/auroux/netcdf-3.6.2/nf_test/test_put.F:6542: undefined reference to 
`_nf_put_att_real_'
/home/auroux/netcdf-3.6.2/nf_test/test_put.F:6542: undefined reference to 
`_nf_put_att_real_'
/home/auroux/netcdf-3.6.2/nf_test/test_put.F:6545: undefined reference to 
`_nf_strerror_'
/home/auroux/netcdf-3.6.2/nf_test/test_put.F:6555: undefined reference to 
`_nf_close_'
/home/auroux/netcdf-3.6.2/nf_test/test_put.F:6559: undefined reference to 
`_nf_delete_'
/home/auroux/netcdf-3.6.2/nf_test/test_put.F:6513: undefined reference to 
`__gfortran_stop_string'
test_put.o: In function `test_nf_put_att_int_':
/home/auroux/netcdf-3.6.2/nf_test/test_put.F:6424: undefined reference to 
`_nf_create_'
/home/auroux/netcdf-3.6.2/nf_test/test_put.F:6440: undefined reference to 
`_nf_put_att_int_'
/home/auroux/netcdf-3.6.2/nf_test/test_put.F:6445: undefined reference to 
`_nf_put_att_int_'
/home/auroux/netcdf-3.6.2/nf_test/test_put.F:6450: undefined reference to 
`_nf_put_att_int_'
/home/auroux/netcdf-3.6.2/nf_test/test_put.F:6465: undefined reference to 
`_nf_put_att_int_'
/home/auroux/netcdf-3.6.2/nf_test/test_put.F:6465: undefined reference to 
`_nf_put_att_int_'
/home/auroux/netcdf-3.6.2/nf_test/test_put.F:6468: undefined reference to 
`_nf_strerror_'
/home/auroux/netcdf-3.6.2/nf_test/test_put.F:6478: undefined reference to 
`_nf_close_'
/home/auroux/netcdf-3.6.2/nf_test/test_put.F:6482: undefined reference to 
`_nf_delete_'
/home/auroux/netcdf-3.6.2/nf_test/test_put.F:6436: undefined reference to 
`__gfortran_stop_string'
test_put.o: In function `test_nf_put_att_int2_':
/home/auroux/netcdf-3.6.2/nf_test/test_put.F:6346: undefined reference to 
`_nf_create_'
/home/auroux/netcdf-3.6.2/nf_test/test_put.F:6362: undefined reference to 
`_nf_put_att_int2_'
/home/auroux/netcdf-3.6.2/nf_test/test_put.F:6367: undefined reference to 
`_nf_put_att_int2_'
/home/auroux/netcdf-3.6.2/nf_test/test_put.F:6372: undefined reference to 
`_nf_put_att_int2_'
/home/auroux/netcdf-3.6.2/nf_test/test_put.F:6387: undefined reference to 
`_nf_put_att_int2_'
/home/auroux/netcdf-3.6.2/nf_test/test_put.F:6387: undefined reference to 
`_nf_put_att_int2_'
/home/auroux/netcdf-3.6.2/nf_test/test_put.F:6390: undefined reference to 
`_nf_strerror_'
/home/auroux/netcdf-3.6.2/nf_test/test_put.F:6400: undefined reference to 
`_nf_close_'
/home/auroux/netcdf-3.6.2/nf_test/test_put.F:6404: undefined reference to 
`_nf_delete_'
/home/auroux/netcdf-3.6.2/nf_test/test_put.F:6358: undefined reference to 
`__gfortran_stop_string'
test_put.o: In function `test_nf_put_att_int1_':
/home/auroux/netcdf-3.6.2/nf_test/test_put.F:6267: undefined reference to 
`_nf_create_'
/home/auroux/netcdf-3.6.2/nf_test/test_put.F:6283: undefined reference to 
`_nf_put_att_int1_'
/home/auroux/netcdf-3.6.2/nf_test/test_put.F:6288: undefined reference to 
`_nf_put_att_int1_'
/home/auroux/netcdf-3.6.2/nf_test/test_put.F:6293: undefined reference to 
`_nf_put_att_int1_'
/home/auroux/netcdf-3.6.2/nf_test/test_put.F:6308: undefined reference to 
`_nf_put_att_int1_'
/home/auroux/netcdf-3.6.2/nf_test/test_put.F:6308: undefined reference to 
`_nf_put_att_int1_'
/home/auroux/netcdf-3.6.2/nf_test/test_put.F:6311: undefined reference to 
`_nf_strerror_'
/home/auroux/netcdf-3.6.2/nf_test/test_put.F:6321: undefined reference to 
`_nf_close_'
/home/auroux/netcdf-3.6.2/nf_test/test_put.F:6325: undefined reference to 
`_nf_delete_'
/home/auroux/netcdf-3.6.2/nf_test/test_put.F:6279: undefined reference to 
`__gfortran_stop_string'
test_put.o: In function `test_nf_put_att_text_':
/home/auroux/netcdf-3.6.2/nf_test/test_put.F:6209: undefined reference to 
`_nf_create_'
/home/auroux/netcdf-3.6.2/nf_test/test_put.F:6223: undefined reference to 
`_nf_put_att_text_'
/home/auroux/netcdf-3.6.2/nf_test/test_put.F:6228: undefined reference to 
`_nf_put_att_text_'
/home/auroux/netcdf-3.6.2/nf_test/test_put.F:6235: undefined reference to 
`_nf_put_att_text_'
/home/auroux/netcdf-3.6.2/nf_test/test_put.F:6237: undefined reference to 
`_nf_strerror_'
/home/auroux/netcdf-3.6.2/nf_test/test_put.F:6243: undefined reference to 
`_nf_close_'
/home/auroux/netcdf-3.6.2/nf_test/test_put.F:6247: undefined reference to 
`_nf_delete_'
/home/auroux/netcdf-3.6.2/nf_test/test_put.F:6221: undefined reference to 
`__gfortran_stop_string'
test_put.o: In function `test_nf_put_varm_double_':
/home/auroux/netcdf-3.6.2/nf_test/test_put.F:6022: undefined reference to 
`_nf_create_'
/home/auroux/netcdf-3.6.2/nf_test/test_put.F:6029: undefined reference to 
`_nf_enddef_'
/home/auroux/netcdf-3.6.2/nf_test/test_put.F:6048: undefined reference to 
`_nf_put_varm_double_'
/home/auroux/netcdf-3.6.2/nf_test/test_put.F:6053: undefined reference to 
`_nf_put_varm_double_'
/home/auroux/netcdf-3.6.2/nf_test/test_put.F:6073: undefined reference to 
`_nf_put_varm_double_'
/home/auroux/netcdf-3.6.2/nf_test/test_put.F:6085: undefined reference to 
`_nf_put_varm_double_'
/home/auroux/netcdf-3.6.2/nf_test/test_put.F:6061: undefined reference to 
`_nf_put_varm_double_'
test_put.o:/home/auroux/netcdf-3.6.2/nf_test/test_put.F:6073: more undefined 
references to `_nf_put_varm_double_' follow
test_put.o: In function `test_nf_put_varm_double_':
/home/auroux/netcdf-3.6.2/nf_test/test_put.F:6173: undefined reference to 
`_nf_strerror_'
/home/auroux/netcdf-3.6.2/nf_test/test_put.F:6186: undefined reference to 
`_nf_close_'
/home/auroux/netcdf-3.6.2/nf_test/test_put.F:6192: undefined reference to 
`_nf_delete_'
/home/auroux/netcdf-3.6.2/nf_test/test_put.F:6085: undefined reference to 
`_nf_put_varm_double_'
/home/auroux/netcdf-3.6.2/nf_test/test_put.F:6073: undefined reference to 
`_nf_put_varm_double_'
/home/auroux/netcdf-3.6.2/nf_test/test_put.F:6037: undefined reference to 
`__gfortran_stop_string'
/home/auroux/netcdf-3.6.2/nf_test/test_put.F:6039: undefined reference to 
`__gfortran_stop_string'
test_put.o: In function `test_nf_put_varm_real_':
/home/auroux/netcdf-3.6.2/nf_test/test_put.F:5818: undefined reference to 
`_nf_create_'
/home/auroux/netcdf-3.6.2/nf_test/test_put.F:5825: undefined reference to 
`_nf_enddef_'
/home/auroux/netcdf-3.6.2/nf_test/test_put.F:5844: undefined reference to 
`_nf_put_varm_real_'
/home/auroux/netcdf-3.6.2/nf_test/test_put.F:5849: undefined reference to 
`_nf_put_varm_real_'
/home/auroux/netcdf-3.6.2/nf_test/test_put.F:5869: undefined reference to 
`_nf_put_varm_real_'
/home/auroux/netcdf-3.6.2/nf_test/test_put.F:5881: undefined reference to 
`_nf_put_varm_real_'
/home/auroux/netcdf-3.6.2/nf_test/test_put.F:5857: undefined reference to 
`_nf_put_varm_real_'
test_put.o:/home/auroux/netcdf-3.6.2/nf_test/test_put.F:5869: more undefined 
references to `_nf_put_varm_real_' follow
test_put.o: In function `test_nf_put_varm_real_':
/home/auroux/netcdf-3.6.2/nf_test/test_put.F:5969: undefined reference to 
`_nf_strerror_'
/home/auroux/netcdf-3.6.2/nf_test/test_put.F:5982: undefined reference to 
`_nf_close_'
/home/auroux/netcdf-3.6.2/nf_test/test_put.F:5988: undefined reference to 
`_nf_delete_'
/home/auroux/netcdf-3.6.2/nf_test/test_put.F:5881: undefined reference to 
`_nf_put_varm_real_'
/home/auroux/netcdf-3.6.2/nf_test/test_put.F:5869: undefined reference to 
`_nf_put_varm_real_'
/home/auroux/netcdf-3.6.2/nf_test/test_put.F:5833: undefined reference to 
`__gfortran_stop_string'
/home/auroux/netcdf-3.6.2/nf_test/test_put.F:5835: undefined reference to 
`__gfortran_stop_string'
test_put.o: In function `test_nf_put_varm_int_':
/home/auroux/netcdf-3.6.2/nf_test/test_put.F:5614: undefined reference to 
`_nf_create_'
/home/auroux/netcdf-3.6.2/nf_test/test_put.F:5621: undefined reference to 
`_nf_enddef_'
/home/auroux/netcdf-3.6.2/nf_test/test_put.F:5640: undefined reference to 
`_nf_put_varm_int_'
/home/auroux/netcdf-3.6.2/nf_test/test_put.F:5645: undefined reference to 
`_nf_put_varm_int_'
/home/auroux/netcdf-3.6.2/nf_test/test_put.F:5665: undefined reference to 
`_nf_put_varm_int_'
/home/auroux/netcdf-3.6.2/nf_test/test_put.F:5677: undefined reference to 
`_nf_put_varm_int_'
/home/auroux/netcdf-3.6.2/nf_test/test_put.F:5653: undefined reference to 
`_nf_put_varm_int_'
test_put.o:/home/auroux/netcdf-3.6.2/nf_test/test_put.F:5665: more undefined 
references to `_nf_put_varm_int_' follow
test_put.o: In function `test_nf_put_varm_int_':
/home/auroux/netcdf-3.6.2/nf_test/test_put.F:5765: undefined reference to 
`_nf_strerror_'
/home/auroux/netcdf-3.6.2/nf_test/test_put.F:5778: undefined reference to 
`_nf_close_'
/home/auroux/netcdf-3.6.2/nf_test/test_put.F:5784: undefined reference to 
`_nf_delete_'
/home/auroux/netcdf-3.6.2/nf_test/test_put.F:5677: undefined reference to 
`_nf_put_varm_int_'
/home/auroux/netcdf-3.6.2/nf_test/test_put.F:5665: undefined reference to 
`_nf_put_varm_int_'
/home/auroux/netcdf-3.6.2/nf_test/test_put.F:5629: undefined reference to 
`__gfortran_stop_string'
/home/auroux/netcdf-3.6.2/nf_test/test_put.F:5631: undefined reference to 
`__gfortran_stop_string'
test_put.o: In function `test_nf_put_varm_int2_':
/home/auroux/netcdf-3.6.2/nf_test/test_put.F:5409: undefined reference to 
`_nf_create_'
/home/auroux/netcdf-3.6.2/nf_test/test_put.F:5416: undefined reference to 
`_nf_enddef_'
/home/auroux/netcdf-3.6.2/nf_test/test_put.F:5435: undefined reference to 
`_nf_put_varm_int2_'
/home/auroux/netcdf-3.6.2/nf_test/test_put.F:5440: undefined reference to 
`_nf_put_varm_int2_'
/home/auroux/netcdf-3.6.2/nf_test/test_put.F:5460: undefined reference to 
`_nf_put_varm_int2_'
/home/auroux/netcdf-3.6.2/nf_test/test_put.F:5472: undefined reference to 
`_nf_put_varm_int2_'
/home/auroux/netcdf-3.6.2/nf_test/test_put.F:5448: undefined reference to 
`_nf_put_varm_int2_'
test_put.o:/home/auroux/netcdf-3.6.2/nf_test/test_put.F:5460: more undefined 
references to `_nf_put_varm_int2_' follow
test_put.o: In function `test_nf_put_varm_int2_':
/home/auroux/netcdf-3.6.2/nf_test/test_put.F:5560: undefined reference to 
`_nf_strerror_'
/home/auroux/netcdf-3.6.2/nf_test/test_put.F:5573: undefined reference to 
`_nf_close_'
/home/auroux/netcdf-3.6.2/nf_test/test_put.F:5579: undefined reference to 
`_nf_delete_'
/home/auroux/netcdf-3.6.2/nf_test/test_put.F:5472: undefined reference to 
`_nf_put_varm_int2_'
/home/auroux/netcdf-3.6.2/nf_test/test_put.F:5460: undefined reference to 
`_nf_put_varm_int2_'
/home/auroux/netcdf-3.6.2/nf_test/test_put.F:5424: undefined reference to 
`__gfortran_stop_string'
/home/auroux/netcdf-3.6.2/nf_test/test_put.F:5426: undefined reference to 
`__gfortran_stop_string'
test_put.o: In function `test_nf_put_varm_int1_':
/home/auroux/netcdf-3.6.2/nf_test/test_put.F:5203: undefined reference to 
`_nf_create_'
/home/auroux/netcdf-3.6.2/nf_test/test_put.F:5210: undefined reference to 
`_nf_enddef_'
/home/auroux/netcdf-3.6.2/nf_test/test_put.F:5229: undefined reference to 
`_nf_put_varm_int1_'
/home/auroux/netcdf-3.6.2/nf_test/test_put.F:5234: undefined reference to 
`_nf_put_varm_int1_'
/home/auroux/netcdf-3.6.2/nf_test/test_put.F:5254: undefined reference to 
`_nf_put_varm_int1_'
/home/auroux/netcdf-3.6.2/nf_test/test_put.F:5266: undefined reference to 
`_nf_put_varm_int1_'
/home/auroux/netcdf-3.6.2/nf_test/test_put.F:5242: undefined reference to 
`_nf_put_varm_int1_'
test_put.o:/home/auroux/netcdf-3.6.2/nf_test/test_put.F:5254: more undefined 
references to `_nf_put_varm_int1_' follow
test_put.o: In function `test_nf_put_varm_int1_':
/home/auroux/netcdf-3.6.2/nf_test/test_put.F:5354: undefined reference to 
`_nf_strerror_'
/home/auroux/netcdf-3.6.2/nf_test/test_put.F:5367: undefined reference to 
`_nf_close_'
/home/auroux/netcdf-3.6.2/nf_test/test_put.F:5373: undefined reference to 
`_nf_delete_'
/home/auroux/netcdf-3.6.2/nf_test/test_put.F:5266: undefined reference to 
`_nf_put_varm_int1_'
/home/auroux/netcdf-3.6.2/nf_test/test_put.F:5254: undefined reference to 
`_nf_put_varm_int1_'
/home/auroux/netcdf-3.6.2/nf_test/test_put.F:5218: undefined reference to 
`__gfortran_stop_string'
/home/auroux/netcdf-3.6.2/nf_test/test_put.F:5220: undefined reference to 
`__gfortran_stop_string'
test_put.o: In function `test_nf_put_varm_text_':
/home/auroux/netcdf-3.6.2/nf_test/test_put.F:4998: undefined reference to 
`_nf_create_'
/home/auroux/netcdf-3.6.2/nf_test/test_put.F:5005: undefined reference to 
`_nf_enddef_'
/home/auroux/netcdf-3.6.2/nf_test/test_put.F:5024: undefined reference to 
`_nf_put_varm_text_'
/home/auroux/netcdf-3.6.2/nf_test/test_put.F:5029: undefined reference to 
`_nf_put_varm_text_'
/home/auroux/netcdf-3.6.2/nf_test/test_put.F:5049: undefined reference to 
`_nf_put_varm_text_'
/home/auroux/netcdf-3.6.2/nf_test/test_put.F:5061: undefined reference to 
`_nf_put_varm_text_'
/home/auroux/netcdf-3.6.2/nf_test/test_put.F:5037: undefined reference to 
`_nf_put_varm_text_'
test_put.o:/home/auroux/netcdf-3.6.2/nf_test/test_put.F:5049: more undefined 
references to `_nf_put_varm_text_' follow
test_put.o: In function `test_nf_put_varm_text_':
/home/auroux/netcdf-3.6.2/nf_test/test_put.F:5149: undefined reference to 
`_nf_strerror_'
/home/auroux/netcdf-3.6.2/nf_test/test_put.F:5162: undefined reference to 
`_nf_close_'
/home/auroux/netcdf-3.6.2/nf_test/test_put.F:5168: undefined reference to 
`_nf_delete_'
/home/auroux/netcdf-3.6.2/nf_test/test_put.F:5061: undefined reference to 
`_nf_put_varm_text_'
/home/auroux/netcdf-3.6.2/nf_test/test_put.F:5049: undefined reference to 
`_nf_put_varm_text_'
/home/auroux/netcdf-3.6.2/nf_test/test_put.F:5013: undefined reference to 
`__gfortran_stop_string'
/home/auroux/netcdf-3.6.2/nf_test/test_put.F:5015: undefined reference to 
`__gfortran_stop_string'
test_put.o: In function `test_nf_put_vars_double_':
/home/auroux/netcdf-3.6.2/nf_test/test_put.F:4802: undefined reference to 
`_nf_create_'
/home/auroux/netcdf-3.6.2/nf_test/test_put.F:4809: undefined reference to 
`_nf_enddef_'
/home/auroux/netcdf-3.6.2/nf_test/test_put.F:4826: undefined reference to 
`_nf_put_vars_double_'
/home/auroux/netcdf-3.6.2/nf_test/test_put.F:4831: undefined reference to 
`_nf_put_vars_double_'
/home/auroux/netcdf-3.6.2/nf_test/test_put.F:4851: undefined reference to 
`_nf_put_vars_double_'
/home/auroux/netcdf-3.6.2/nf_test/test_put.F:4863: undefined reference to 
`_nf_put_vars_double_'
/home/auroux/netcdf-3.6.2/nf_test/test_put.F:4839: undefined reference to 
`_nf_put_vars_double_'
test_put.o:/home/auroux/netcdf-3.6.2/nf_test/test_put.F:4851: more undefined 
references to `_nf_put_vars_double_' follow
test_put.o: In function `test_nf_put_vars_double_':
/home/auroux/netcdf-3.6.2/nf_test/test_put.F:4944: undefined reference to 
`_nf_strerror_'
/home/auroux/netcdf-3.6.2/nf_test/test_put.F:4957: undefined reference to 
`_nf_close_'
/home/auroux/netcdf-3.6.2/nf_test/test_put.F:4963: undefined reference to 
`_nf_delete_'
/home/auroux/netcdf-3.6.2/nf_test/test_put.F:4817: undefined reference to 
`__gfortran_stop_string'
/home/auroux/netcdf-3.6.2/nf_test/test_put.F:4819: undefined reference to 
`__gfortran_stop_string'
test_put.o: In function `test_nf_put_vars_real_':
/home/auroux/netcdf-3.6.2/nf_test/test_put.F:4608: undefined reference to 
`_nf_create_'
/home/auroux/netcdf-3.6.2/nf_test/test_put.F:4615: undefined reference to 
`_nf_enddef_'
/home/auroux/netcdf-3.6.2/nf_test/test_put.F:4632: undefined reference to 
`_nf_put_vars_real_'
/home/auroux/netcdf-3.6.2/nf_test/test_put.F:4637: undefined reference to 
`_nf_put_vars_real_'
/home/auroux/netcdf-3.6.2/nf_test/test_put.F:4657: undefined reference to 
`_nf_put_vars_real_'
/home/auroux/netcdf-3.6.2/nf_test/test_put.F:4669: undefined reference to 
`_nf_put_vars_real_'
/home/auroux/netcdf-3.6.2/nf_test/test_put.F:4645: undefined reference to 
`_nf_put_vars_real_'
test_put.o:/home/auroux/netcdf-3.6.2/nf_test/test_put.F:4657: more undefined 
references to `_nf_put_vars_real_' follow
test_put.o: In function `test_nf_put_vars_real_':
/home/auroux/netcdf-3.6.2/nf_test/test_put.F:4750: undefined reference to 
`_nf_strerror_'
/home/auroux/netcdf-3.6.2/nf_test/test_put.F:4763: undefined reference to 
`_nf_close_'
/home/auroux/netcdf-3.6.2/nf_test/test_put.F:4769: undefined reference to 
`_nf_delete_'
/home/auroux/netcdf-3.6.2/nf_test/test_put.F:4623: undefined reference to 
`__gfortran_stop_string'
/home/auroux/netcdf-3.6.2/nf_test/test_put.F:4625: undefined reference to 
`__gfortran_stop_string'
test_put.o: In function `test_nf_put_vars_int_':
/home/auroux/netcdf-3.6.2/nf_test/test_put.F:4414: undefined reference to 
`_nf_create_'
/home/auroux/netcdf-3.6.2/nf_test/test_put.F:4421: undefined reference to 
`_nf_enddef_'
/home/auroux/netcdf-3.6.2/nf_test/test_put.F:4438: undefined reference to 
`_nf_put_vars_int_'
/home/auroux/netcdf-3.6.2/nf_test/test_put.F:4443: undefined reference to 
`_nf_put_vars_int_'
/home/auroux/netcdf-3.6.2/nf_test/test_put.F:4463: undefined reference to 
`_nf_put_vars_int_'
/home/auroux/netcdf-3.6.2/nf_test/test_put.F:4475: undefined reference to 
`_nf_put_vars_int_'
/home/auroux/netcdf-3.6.2/nf_test/test_put.F:4451: undefined reference to 
`_nf_put_vars_int_'
test_put.o:/home/auroux/netcdf-3.6.2/nf_test/test_put.F:4463: more undefined 
references to `_nf_put_vars_int_' follow
test_put.o: In function `test_nf_put_vars_int_':
/home/auroux/netcdf-3.6.2/nf_test/test_put.F:4556: undefined reference to 
`_nf_strerror_'
/home/auroux/netcdf-3.6.2/nf_test/test_put.F:4569: undefined reference to 
`_nf_close_'
/home/auroux/netcdf-3.6.2/nf_test/test_put.F:4575: undefined reference to 
`_nf_delete_'
/home/auroux/netcdf-3.6.2/nf_test/test_put.F:4429: undefined reference to 
`__gfortran_stop_string'
/home/auroux/netcdf-3.6.2/nf_test/test_put.F:4431: undefined reference to 
`__gfortran_stop_string'
test_put.o: In function `test_nf_put_vars_int2_':
/home/auroux/netcdf-3.6.2/nf_test/test_put.F:4219: undefined reference to 
`_nf_create_'
/home/auroux/netcdf-3.6.2/nf_test/test_put.F:4226: undefined reference to 
`_nf_enddef_'
/home/auroux/netcdf-3.6.2/nf_test/test_put.F:4243: undefined reference to 
`_nf_put_vars_int2_'
/home/auroux/netcdf-3.6.2/nf_test/test_put.F:4248: undefined reference to 
`_nf_put_vars_int2_'
/home/auroux/netcdf-3.6.2/nf_test/test_put.F:4268: undefined reference to 
`_nf_put_vars_int2_'
/home/auroux/netcdf-3.6.2/nf_test/test_put.F:4280: undefined reference to 
`_nf_put_vars_int2_'
/home/auroux/netcdf-3.6.2/nf_test/test_put.F:4256: undefined reference to 
`_nf_put_vars_int2_'
test_put.o:/home/auroux/netcdf-3.6.2/nf_test/test_put.F:4268: more undefined 
references to `_nf_put_vars_int2_' follow
test_put.o: In function `test_nf_put_vars_int2_':
/home/auroux/netcdf-3.6.2/nf_test/test_put.F:4361: undefined reference to 
`_nf_strerror_'
/home/auroux/netcdf-3.6.2/nf_test/test_put.F:4374: undefined reference to 
`_nf_close_'
/home/auroux/netcdf-3.6.2/nf_test/test_put.F:4380: undefined reference to 
`_nf_delete_'
/home/auroux/netcdf-3.6.2/nf_test/test_put.F:4234: undefined reference to 
`__gfortran_stop_string'
/home/auroux/netcdf-3.6.2/nf_test/test_put.F:4236: undefined reference to 
`__gfortran_stop_string'
test_put.o: In function `test_nf_put_vars_int1_':
/home/auroux/netcdf-3.6.2/nf_test/test_put.F:4023: undefined reference to 
`_nf_create_'
/home/auroux/netcdf-3.6.2/nf_test/test_put.F:4030: undefined reference to 
`_nf_enddef_'
/home/auroux/netcdf-3.6.2/nf_test/test_put.F:4047: undefined reference to 
`_nf_put_vars_int1_'
/home/auroux/netcdf-3.6.2/nf_test/test_put.F:4052: undefined reference to 
`_nf_put_vars_int1_'
/home/auroux/netcdf-3.6.2/nf_test/test_put.F:4072: undefined reference to 
`_nf_put_vars_int1_'
/home/auroux/netcdf-3.6.2/nf_test/test_put.F:4084: undefined reference to 
`_nf_put_vars_int1_'
/home/auroux/netcdf-3.6.2/nf_test/test_put.F:4060: undefined reference to 
`_nf_put_vars_int1_'
test_put.o:/home/auroux/netcdf-3.6.2/nf_test/test_put.F:4072: more undefined 
references to `_nf_put_vars_int1_' follow
test_put.o: In function `test_nf_put_vars_int1_':
/home/auroux/netcdf-3.6.2/nf_test/test_put.F:4165: undefined reference to 
`_nf_strerror_'
/home/auroux/netcdf-3.6.2/nf_test/test_put.F:4178: undefined reference to 
`_nf_close_'
/home/auroux/netcdf-3.6.2/nf_test/test_put.F:4184: undefined reference to 
`_nf_delete_'
/home/auroux/netcdf-3.6.2/nf_test/test_put.F:4038: undefined reference to 
`__gfortran_stop_string'
/home/auroux/netcdf-3.6.2/nf_test/test_put.F:4040: undefined reference to 
`__gfortran_stop_string'
test_put.o: In function `test_nf_put_vars_text_':
/home/auroux/netcdf-3.6.2/nf_test/test_put.F:3828: undefined reference to 
`_nf_create_'
/home/auroux/netcdf-3.6.2/nf_test/test_put.F:3835: undefined reference to 
`_nf_enddef_'
/home/auroux/netcdf-3.6.2/nf_test/test_put.F:3852: undefined reference to 
`_nf_put_vars_text_'
/home/auroux/netcdf-3.6.2/nf_test/test_put.F:3857: undefined reference to 
`_nf_put_vars_text_'
/home/auroux/netcdf-3.6.2/nf_test/test_put.F:3877: undefined reference to 
`_nf_put_vars_text_'
/home/auroux/netcdf-3.6.2/nf_test/test_put.F:3889: undefined reference to 
`_nf_put_vars_text_'
/home/auroux/netcdf-3.6.2/nf_test/test_put.F:3865: undefined reference to 
`_nf_put_vars_text_'
test_put.o:/home/auroux/netcdf-3.6.2/nf_test/test_put.F:3877: more undefined 
references to `_nf_put_vars_text_' follow
test_put.o: In function `test_nf_put_vars_text_':
/home/auroux/netcdf-3.6.2/nf_test/test_put.F:3970: undefined reference to 
`_nf_strerror_'
/home/auroux/netcdf-3.6.2/nf_test/test_put.F:3983: undefined reference to 
`_nf_close_'
/home/auroux/netcdf-3.6.2/nf_test/test_put.F:3989: undefined reference to 
`_nf_delete_'
/home/auroux/netcdf-3.6.2/nf_test/test_put.F:3843: undefined reference to 
`__gfortran_stop_string'
/home/auroux/netcdf-3.6.2/nf_test/test_put.F:3845: undefined reference to 
`__gfortran_stop_string'
test_put.o: In function `test_nf_put_vara_double_':
/home/auroux/netcdf-3.6.2/nf_test/test_put.F:3639: undefined reference to 
`_nf_create_'
/home/auroux/netcdf-3.6.2/nf_test/test_put.F:3646: undefined reference to 
`_nf_enddef_'
/home/auroux/netcdf-3.6.2/nf_test/test_put.F:3662: undefined reference to 
`_nf_put_vara_double_'
/home/auroux/netcdf-3.6.2/nf_test/test_put.F:3666: undefined reference to 
`_nf_put_vara_double_'
/home/auroux/netcdf-3.6.2/nf_test/test_put.F:3701: undefined reference to 
`_nf_put_vara_double_'
/home/auroux/netcdf-3.6.2/nf_test/test_put.F:3705: undefined reference to 
`_nf_put_vara_double_'
/home/auroux/netcdf-3.6.2/nf_test/test_put.F:3723: undefined reference to 
`_nf_put_vara_double_'
test_put.o:/home/auroux/netcdf-3.6.2/nf_test/test_put.F:3684: more undefined 
references to `_nf_put_vara_double_' follow
test_put.o: In function `test_nf_put_vara_double_':
/home/auroux/netcdf-3.6.2/nf_test/test_put.F:3788: undefined reference to 
`_nf_close_'
/home/auroux/netcdf-3.6.2/nf_test/test_put.F:3794: undefined reference to 
`_nf_delete_'
/home/auroux/netcdf-3.6.2/nf_test/test_put.F:3684: undefined reference to 
`_nf_put_vara_double_'
/home/auroux/netcdf-3.6.2/nf_test/test_put.F:3776: undefined reference to 
`_nf_strerror_'
/home/auroux/netcdf-3.6.2/nf_test/test_put.F:3726: undefined reference to 
`_nf_strerror_'
/home/auroux/netcdf-3.6.2/nf_test/test_put.F:3654: undefined reference to 
`__gfortran_stop_string'
/home/auroux/netcdf-3.6.2/nf_test/test_put.F:3656: undefined reference to 
`__gfortran_stop_string'
test_put.o: In function `test_nf_put_vara_real_':
/home/auroux/netcdf-3.6.2/nf_test/test_put.F:3457: undefined reference to 
`_nf_create_'
/home/auroux/netcdf-3.6.2/nf_test/test_put.F:3464: undefined reference to 
`_nf_enddef_'
/home/auroux/netcdf-3.6.2/nf_test/test_put.F:3480: undefined reference to 
`_nf_put_vara_real_'
/home/auroux/netcdf-3.6.2/nf_test/test_put.F:3484: undefined reference to 
`_nf_put_vara_real_'
/home/auroux/netcdf-3.6.2/nf_test/test_put.F:3519: undefined reference to 
`_nf_put_vara_real_'
/home/auroux/netcdf-3.6.2/nf_test/test_put.F:3523: undefined reference to 
`_nf_put_vara_real_'
/home/auroux/netcdf-3.6.2/nf_test/test_put.F:3541: undefined reference to 
`_nf_put_vara_real_'
test_put.o:/home/auroux/netcdf-3.6.2/nf_test/test_put.F:3502: more undefined 
references to `_nf_put_vara_real_' follow
test_put.o: In function `test_nf_put_vara_real_':
/home/auroux/netcdf-3.6.2/nf_test/test_put.F:3606: undefined reference to 
`_nf_close_'
/home/auroux/netcdf-3.6.2/nf_test/test_put.F:3612: undefined reference to 
`_nf_delete_'
/home/auroux/netcdf-3.6.2/nf_test/test_put.F:3502: undefined reference to 
`_nf_put_vara_real_'
/home/auroux/netcdf-3.6.2/nf_test/test_put.F:3594: undefined reference to 
`_nf_strerror_'
/home/auroux/netcdf-3.6.2/nf_test/test_put.F:3544: undefined reference to 
`_nf_strerror_'
/home/auroux/netcdf-3.6.2/nf_test/test_put.F:3472: undefined reference to 
`__gfortran_stop_string'
/home/auroux/netcdf-3.6.2/nf_test/test_put.F:3474: undefined reference to 
`__gfortran_stop_string'
test_put.o: In function `test_nf_put_vara_int_':
/home/auroux/netcdf-3.6.2/nf_test/test_put.F:3275: undefined reference to 
`_nf_create_'
/home/auroux/netcdf-3.6.2/nf_test/test_put.F:3282: undefined reference to 
`_nf_enddef_'
/home/auroux/netcdf-3.6.2/nf_test/test_put.F:3298: undefined reference to 
`_nf_put_vara_int_'
/home/auroux/netcdf-3.6.2/nf_test/test_put.F:3302: undefined reference to 
`_nf_put_vara_int_'
/home/auroux/netcdf-3.6.2/nf_test/test_put.F:3337: undefined reference to 
`_nf_put_vara_int_'
/home/auroux/netcdf-3.6.2/nf_test/test_put.F:3341: undefined reference to 
`_nf_put_vara_int_'
/home/auroux/netcdf-3.6.2/nf_test/test_put.F:3359: undefined reference to 
`_nf_put_vara_int_'
test_put.o:/home/auroux/netcdf-3.6.2/nf_test/test_put.F:3320: more undefined 
references to `_nf_put_vara_int_' follow
test_put.o: In function `test_nf_put_vara_int_':
/home/auroux/netcdf-3.6.2/nf_test/test_put.F:3424: undefined reference to 
`_nf_close_'
/home/auroux/netcdf-3.6.2/nf_test/test_put.F:3430: undefined reference to 
`_nf_delete_'
/home/auroux/netcdf-3.6.2/nf_test/test_put.F:3320: undefined reference to 
`_nf_put_vara_int_'
/home/auroux/netcdf-3.6.2/nf_test/test_put.F:3412: undefined reference to 
`_nf_strerror_'
/home/auroux/netcdf-3.6.2/nf_test/test_put.F:3362: undefined reference to 
`_nf_strerror_'
/home/auroux/netcdf-3.6.2/nf_test/test_put.F:3290: undefined reference to 
`__gfortran_stop_string'
/home/auroux/netcdf-3.6.2/nf_test/test_put.F:3292: undefined reference to 
`__gfortran_stop_string'
test_put.o: In function `test_nf_put_vara_int2_':
/home/auroux/netcdf-3.6.2/nf_test/test_put.F:3092: undefined reference to 
`_nf_create_'
/home/auroux/netcdf-3.6.2/nf_test/test_put.F:3099: undefined reference to 
`_nf_enddef_'
/home/auroux/netcdf-3.6.2/nf_test/test_put.F:3115: undefined reference to 
`_nf_put_vara_int2_'
/home/auroux/netcdf-3.6.2/nf_test/test_put.F:3119: undefined reference to 
`_nf_put_vara_int2_'
/home/auroux/netcdf-3.6.2/nf_test/test_put.F:3154: undefined reference to 
`_nf_put_vara_int2_'
/home/auroux/netcdf-3.6.2/nf_test/test_put.F:3158: undefined reference to 
`_nf_put_vara_int2_'
/home/auroux/netcdf-3.6.2/nf_test/test_put.F:3176: undefined reference to 
`_nf_put_vara_int2_'
test_put.o:/home/auroux/netcdf-3.6.2/nf_test/test_put.F:3137: more undefined 
references to `_nf_put_vara_int2_' follow
test_put.o: In function `test_nf_put_vara_int2_':
/home/auroux/netcdf-3.6.2/nf_test/test_put.F:3241: undefined reference to 
`_nf_close_'
/home/auroux/netcdf-3.6.2/nf_test/test_put.F:3247: undefined reference to 
`_nf_delete_'
/home/auroux/netcdf-3.6.2/nf_test/test_put.F:3137: undefined reference to 
`_nf_put_vara_int2_'
/home/auroux/netcdf-3.6.2/nf_test/test_put.F:3229: undefined reference to 
`_nf_strerror_'
/home/auroux/netcdf-3.6.2/nf_test/test_put.F:3179: undefined reference to 
`_nf_strerror_'
/home/auroux/netcdf-3.6.2/nf_test/test_put.F:3107: undefined reference to 
`__gfortran_stop_string'
/home/auroux/netcdf-3.6.2/nf_test/test_put.F:3109: undefined reference to 
`__gfortran_stop_string'
test_put.o: In function `test_nf_put_vara_int1_':
/home/auroux/netcdf-3.6.2/nf_test/test_put.F:2908: undefined reference to 
`_nf_create_'
/home/auroux/netcdf-3.6.2/nf_test/test_put.F:2915: undefined reference to 
`_nf_enddef_'
/home/auroux/netcdf-3.6.2/nf_test/test_put.F:2931: undefined reference to 
`_nf_put_vara_int1_'
/home/auroux/netcdf-3.6.2/nf_test/test_put.F:2935: undefined reference to 
`_nf_put_vara_int1_'
/home/auroux/netcdf-3.6.2/nf_test/test_put.F:2970: undefined reference to 
`_nf_put_vara_int1_'
/home/auroux/netcdf-3.6.2/nf_test/test_put.F:2974: undefined reference to 
`_nf_put_vara_int1_'
/home/auroux/netcdf-3.6.2/nf_test/test_put.F:2992: undefined reference to 
`_nf_put_vara_int1_'
test_put.o:/home/auroux/netcdf-3.6.2/nf_test/test_put.F:2953: more undefined 
references to `_nf_put_vara_int1_' follow
test_put.o: In function `test_nf_put_vara_int1_':
/home/auroux/netcdf-3.6.2/nf_test/test_put.F:3057: undefined reference to 
`_nf_close_'
/home/auroux/netcdf-3.6.2/nf_test/test_put.F:3063: undefined reference to 
`_nf_delete_'
/home/auroux/netcdf-3.6.2/nf_test/test_put.F:2953: undefined reference to 
`_nf_put_vara_int1_'
/home/auroux/netcdf-3.6.2/nf_test/test_put.F:3045: undefined reference to 
`_nf_strerror_'
/home/auroux/netcdf-3.6.2/nf_test/test_put.F:2995: undefined reference to 
`_nf_strerror_'
/home/auroux/netcdf-3.6.2/nf_test/test_put.F:2923: undefined reference to 
`__gfortran_stop_string'
/home/auroux/netcdf-3.6.2/nf_test/test_put.F:2925: undefined reference to 
`__gfortran_stop_string'
test_put.o: In function `test_nf_put_vara_text_':
/home/auroux/netcdf-3.6.2/nf_test/test_put.F:2725: undefined reference to 
`_nf_create_'
/home/auroux/netcdf-3.6.2/nf_test/test_put.F:2732: undefined reference to 
`_nf_enddef_'
/home/auroux/netcdf-3.6.2/nf_test/test_put.F:2748: undefined reference to 
`_nf_put_vara_text_'
/home/auroux/netcdf-3.6.2/nf_test/test_put.F:2752: undefined reference to 
`_nf_put_vara_text_'
/home/auroux/netcdf-3.6.2/nf_test/test_put.F:2787: undefined reference to 
`_nf_put_vara_text_'
/home/auroux/netcdf-3.6.2/nf_test/test_put.F:2791: undefined reference to 
`_nf_put_vara_text_'
/home/auroux/netcdf-3.6.2/nf_test/test_put.F:2809: undefined reference to 
`_nf_put_vara_text_'
test_put.o:/home/auroux/netcdf-3.6.2/nf_test/test_put.F:2770: more undefined 
references to `_nf_put_vara_text_' follow
test_put.o: In function `test_nf_put_vara_text_':
/home/auroux/netcdf-3.6.2/nf_test/test_put.F:2874: undefined reference to 
`_nf_close_'
/home/auroux/netcdf-3.6.2/nf_test/test_put.F:2880: undefined reference to 
`_nf_delete_'
/home/auroux/netcdf-3.6.2/nf_test/test_put.F:2770: undefined reference to 
`_nf_put_vara_text_'
/home/auroux/netcdf-3.6.2/nf_test/test_put.F:2862: undefined reference to 
`_nf_strerror_'
/home/auroux/netcdf-3.6.2/nf_test/test_put.F:2812: undefined reference to 
`_nf_strerror_'
/home/auroux/netcdf-3.6.2/nf_test/test_put.F:2740: undefined reference to 
`__gfortran_stop_string'
/home/auroux/netcdf-3.6.2/nf_test/test_put.F:2742: undefined reference to 
`__gfortran_stop_string'
test_put.o: In function `test_nf_put_var_double_':
/home/auroux/netcdf-3.6.2/nf_test/test_put.F:2579: undefined reference to 
`_nf_create_'
/home/auroux/netcdf-3.6.2/nf_test/test_put.F:2586: undefined reference to 
`_nf_enddef_'
/home/auroux/netcdf-3.6.2/nf_test/test_put.F:2593: undefined reference to 
`_nf_put_var_double_'
/home/auroux/netcdf-3.6.2/nf_test/test_put.F:2596: undefined reference to 
`_nf_put_var_double_'
/home/auroux/netcdf-3.6.2/nf_test/test_put.F:2616: undefined reference to 
`_nf_put_var_double_'
/home/auroux/netcdf-3.6.2/nf_test/test_put.F:2638: undefined reference to 
`_nf_inq_varid_'
/home/auroux/netcdf-3.6.2/nf_test/test_put.F:2642: undefined reference to 
`_nf_put_var1_text_'
/home/auroux/netcdf-3.6.2/nf_test/test_put.F:2656: undefined reference to 
`_nf_put_var_double_'
/home/auroux/netcdf-3.6.2/nf_test/test_put.F:2691: undefined reference to 
`_nf_close_'
/home/auroux/netcdf-3.6.2/nf_test/test_put.F:2697: undefined reference to 
`_nf_delete_'
/home/auroux/netcdf-3.6.2/nf_test/test_put.F:2675: undefined reference to 
`_nf_put_var_double_'
/home/auroux/netcdf-3.6.2/nf_test/test_put.F:2620: undefined reference to 
`_nf_strerror_'
/home/auroux/netcdf-3.6.2/nf_test/test_put.F:2679: undefined reference to 
`_nf_strerror_'
/home/auroux/netcdf-3.6.2/nf_test/test_put.F:2655: undefined reference to 
`__gfortran_stop_string'
/home/auroux/netcdf-3.6.2/nf_test/test_put.F:2653: undefined reference to 
`__gfortran_stop_string'
test_put.o: In function `test_nf_put_var_real_':
/home/auroux/netcdf-3.6.2/nf_test/test_put.F:2440: undefined reference to 
`_nf_create_'
/home/auroux/netcdf-3.6.2/nf_test/test_put.F:2447: undefined reference to 
`_nf_enddef_'
/home/auroux/netcdf-3.6.2/nf_test/test_put.F:2454: undefined reference to 
`_nf_put_var_real_'
/home/auroux/netcdf-3.6.2/nf_test/test_put.F:2457: undefined reference to 
`_nf_put_var_real_'
/home/auroux/netcdf-3.6.2/nf_test/test_put.F:2477: undefined reference to 
`_nf_put_var_real_'
/home/auroux/netcdf-3.6.2/nf_test/test_put.F:2499: undefined reference to 
`_nf_inq_varid_'
/home/auroux/netcdf-3.6.2/nf_test/test_put.F:2503: undefined reference to 
`_nf_put_var1_text_'
/home/auroux/netcdf-3.6.2/nf_test/test_put.F:2517: undefined reference to 
`_nf_put_var_real_'
/home/auroux/netcdf-3.6.2/nf_test/test_put.F:2552: undefined reference to 
`_nf_close_'
/home/auroux/netcdf-3.6.2/nf_test/test_put.F:2558: undefined reference to 
`_nf_delete_'
/home/auroux/netcdf-3.6.2/nf_test/test_put.F:2536: undefined reference to 
`_nf_put_var_real_'
/home/auroux/netcdf-3.6.2/nf_test/test_put.F:2481: undefined reference to 
`_nf_strerror_'
/home/auroux/netcdf-3.6.2/nf_test/test_put.F:2540: undefined reference to 
`_nf_strerror_'
/home/auroux/netcdf-3.6.2/nf_test/test_put.F:2516: undefined reference to 
`__gfortran_stop_string'
/home/auroux/netcdf-3.6.2/nf_test/test_put.F:2514: undefined reference to 
`__gfortran_stop_string'
test_put.o: In function `test_nf_put_var_int_':
/home/auroux/netcdf-3.6.2/nf_test/test_put.F:2301: undefined reference to 
`_nf_create_'
/home/auroux/netcdf-3.6.2/nf_test/test_put.F:2308: undefined reference to 
`_nf_enddef_'
/home/auroux/netcdf-3.6.2/nf_test/test_put.F:2315: undefined reference to 
`_nf_put_var_int_'
/home/auroux/netcdf-3.6.2/nf_test/test_put.F:2318: undefined reference to 
`_nf_put_var_int_'
/home/auroux/netcdf-3.6.2/nf_test/test_put.F:2338: undefined reference to 
`_nf_put_var_int_'
/home/auroux/netcdf-3.6.2/nf_test/test_put.F:2360: undefined reference to 
`_nf_inq_varid_'
/home/auroux/netcdf-3.6.2/nf_test/test_put.F:2364: undefined reference to 
`_nf_put_var1_text_'
/home/auroux/netcdf-3.6.2/nf_test/test_put.F:2378: undefined reference to 
`_nf_put_var_int_'
/home/auroux/netcdf-3.6.2/nf_test/test_put.F:2413: undefined reference to 
`_nf_close_'
/home/auroux/netcdf-3.6.2/nf_test/test_put.F:2419: undefined reference to 
`_nf_delete_'
/home/auroux/netcdf-3.6.2/nf_test/test_put.F:2397: undefined reference to 
`_nf_put_var_int_'
/home/auroux/netcdf-3.6.2/nf_test/test_put.F:2342: undefined reference to 
`_nf_strerror_'
/home/auroux/netcdf-3.6.2/nf_test/test_put.F:2401: undefined reference to 
`_nf_strerror_'
/home/auroux/netcdf-3.6.2/nf_test/test_put.F:2377: undefined reference to 
`__gfortran_stop_string'
/home/auroux/netcdf-3.6.2/nf_test/test_put.F:2375: undefined reference to 
`__gfortran_stop_string'
test_put.o: In function `test_nf_put_var_int2_':
/home/auroux/netcdf-3.6.2/nf_test/test_put.F:2161: undefined reference to 
`_nf_create_'
/home/auroux/netcdf-3.6.2/nf_test/test_put.F:2168: undefined reference to 
`_nf_enddef_'
/home/auroux/netcdf-3.6.2/nf_test/test_put.F:2175: undefined reference to 
`_nf_put_var_int2_'
/home/auroux/netcdf-3.6.2/nf_test/test_put.F:2178: undefined reference to 
`_nf_put_var_int2_'
/home/auroux/netcdf-3.6.2/nf_test/test_put.F:2198: undefined reference to 
`_nf_put_var_int2_'
/home/auroux/netcdf-3.6.2/nf_test/test_put.F:2220: undefined reference to 
`_nf_inq_varid_'
/home/auroux/netcdf-3.6.2/nf_test/test_put.F:2224: undefined reference to 
`_nf_put_var1_text_'
/home/auroux/netcdf-3.6.2/nf_test/test_put.F:2238: undefined reference to 
`_nf_put_var_int2_'
/home/auroux/netcdf-3.6.2/nf_test/test_put.F:2273: undefined reference to 
`_nf_close_'
/home/auroux/netcdf-3.6.2/nf_test/test_put.F:2279: undefined reference to 
`_nf_delete_'
/home/auroux/netcdf-3.6.2/nf_test/test_put.F:2257: undefined reference to 
`_nf_put_var_int2_'
/home/auroux/netcdf-3.6.2/nf_test/test_put.F:2202: undefined reference to 
`_nf_strerror_'
/home/auroux/netcdf-3.6.2/nf_test/test_put.F:2261: undefined reference to 
`_nf_strerror_'
/home/auroux/netcdf-3.6.2/nf_test/test_put.F:2237: undefined reference to 
`__gfortran_stop_string'
/home/auroux/netcdf-3.6.2/nf_test/test_put.F:2235: undefined reference to 
`__gfortran_stop_string'
test_put.o: In function `test_nf_put_var_int1_':
/home/auroux/netcdf-3.6.2/nf_test/test_put.F:2020: undefined reference to 
`_nf_create_'
/home/auroux/netcdf-3.6.2/nf_test/test_put.F:2027: undefined reference to 
`_nf_enddef_'
/home/auroux/netcdf-3.6.2/nf_test/test_put.F:2034: undefined reference to 
`_nf_put_var_int1_'
/home/auroux/netcdf-3.6.2/nf_test/test_put.F:2037: undefined reference to 
`_nf_put_var_int1_'
/home/auroux/netcdf-3.6.2/nf_test/test_put.F:2057: undefined reference to 
`_nf_put_var_int1_'
/home/auroux/netcdf-3.6.2/nf_test/test_put.F:2079: undefined reference to 
`_nf_inq_varid_'
/home/auroux/netcdf-3.6.2/nf_test/test_put.F:2083: undefined reference to 
`_nf_put_var1_text_'
/home/auroux/netcdf-3.6.2/nf_test/test_put.F:2097: undefined reference to 
`_nf_put_var_int1_'
/home/auroux/netcdf-3.6.2/nf_test/test_put.F:2132: undefined reference to 
`_nf_close_'
/home/auroux/netcdf-3.6.2/nf_test/test_put.F:2138: undefined reference to 
`_nf_delete_'
/home/auroux/netcdf-3.6.2/nf_test/test_put.F:2116: undefined reference to 
`_nf_put_var_int1_'
/home/auroux/netcdf-3.6.2/nf_test/test_put.F:2061: undefined reference to 
`_nf_strerror_'
/home/auroux/netcdf-3.6.2/nf_test/test_put.F:2120: undefined reference to 
`_nf_strerror_'
/home/auroux/netcdf-3.6.2/nf_test/test_put.F:2096: undefined reference to 
`__gfortran_stop_string'
/home/auroux/netcdf-3.6.2/nf_test/test_put.F:2094: undefined reference to 
`__gfortran_stop_string'
test_put.o: In function `test_nf_put_var_text_':
/home/auroux/netcdf-3.6.2/nf_test/test_put.F:1880: undefined reference to 
`_nf_create_'
/home/auroux/netcdf-3.6.2/nf_test/test_put.F:1887: undefined reference to 
`_nf_enddef_'
/home/auroux/netcdf-3.6.2/nf_test/test_put.F:1894: undefined reference to 
`_nf_put_var_text_'
/home/auroux/netcdf-3.6.2/nf_test/test_put.F:1897: undefined reference to 
`_nf_put_var_text_'
/home/auroux/netcdf-3.6.2/nf_test/test_put.F:1917: undefined reference to 
`_nf_put_var_text_'
/home/auroux/netcdf-3.6.2/nf_test/test_put.F:1939: undefined reference to 
`_nf_inq_varid_'
/home/auroux/netcdf-3.6.2/nf_test/test_put.F:1943: undefined reference to 
`_nf_put_var1_text_'
/home/auroux/netcdf-3.6.2/nf_test/test_put.F:1957: undefined reference to 
`_nf_put_var_text_'
/home/auroux/netcdf-3.6.2/nf_test/test_put.F:1992: undefined reference to 
`_nf_close_'
/home/auroux/netcdf-3.6.2/nf_test/test_put.F:1998: undefined reference to 
`_nf_delete_'
/home/auroux/netcdf-3.6.2/nf_test/test_put.F:1921: undefined reference to 
`_nf_strerror_'
/home/auroux/netcdf-3.6.2/nf_test/test_put.F:1976: undefined reference to 
`_nf_put_var_text_'
/home/auroux/netcdf-3.6.2/nf_test/test_put.F:1980: undefined reference to 
`_nf_strerror_'
/home/auroux/netcdf-3.6.2/nf_test/test_put.F:1956: undefined reference to 
`__gfortran_stop_string'
/home/auroux/netcdf-3.6.2/nf_test/test_put.F:1954: undefined reference to 
`__gfortran_stop_string'
test_put.o: In function `test_nf_put_var1_double_':
/home/auroux/netcdf-3.6.2/nf_test/test_put.F:1789: undefined reference to 
`_nf_create_'
/home/auroux/netcdf-3.6.2/nf_test/test_put.F:1796: undefined reference to 
`_nf_enddef_'
/home/auroux/netcdf-3.6.2/nf_test/test_put.F:1806: undefined reference to 
`_nf_put_var1_double_'
/home/auroux/netcdf-3.6.2/nf_test/test_put.F:1810: undefined reference to 
`_nf_put_var1_double_'
/home/auroux/netcdf-3.6.2/nf_test/test_put.F:1817: undefined reference to 
`_nf_put_var1_double_'
/home/auroux/netcdf-3.6.2/nf_test/test_put.F:1852: undefined reference to 
`_nf_close_'
/home/auroux/netcdf-3.6.2/nf_test/test_put.F:1858: undefined reference to 
`_nf_delete_'
/home/auroux/netcdf-3.6.2/nf_test/test_put.F:1835: undefined reference to 
`_nf_put_var1_double_'
/home/auroux/netcdf-3.6.2/nf_test/test_put.F:1840: undefined reference to 
`_nf_strerror_'
test_put.o: In function `test_nf_put_var1_real_':
/home/auroux/netcdf-3.6.2/nf_test/test_put.F:1700: undefined reference to 
`_nf_create_'
/home/auroux/netcdf-3.6.2/nf_test/test_put.F:1707: undefined reference to 
`_nf_enddef_'
/home/auroux/netcdf-3.6.2/nf_test/test_put.F:1717: undefined reference to 
`_nf_put_var1_real_'
/home/auroux/netcdf-3.6.2/nf_test/test_put.F:1721: undefined reference to 
`_nf_put_var1_real_'
/home/auroux/netcdf-3.6.2/nf_test/test_put.F:1728: undefined reference to 
`_nf_put_var1_real_'
/home/auroux/netcdf-3.6.2/nf_test/test_put.F:1763: undefined reference to 
`_nf_close_'
/home/auroux/netcdf-3.6.2/nf_test/test_put.F:1769: undefined reference to 
`_nf_delete_'
/home/auroux/netcdf-3.6.2/nf_test/test_put.F:1746: undefined reference to 
`_nf_put_var1_real_'
/home/auroux/netcdf-3.6.2/nf_test/test_put.F:1751: undefined reference to 
`_nf_strerror_'
test_put.o: In function `test_nf_put_var1_int_':
/home/auroux/netcdf-3.6.2/nf_test/test_put.F:1611: undefined reference to 
`_nf_create_'
/home/auroux/netcdf-3.6.2/nf_test/test_put.F:1618: undefined reference to 
`_nf_enddef_'
/home/auroux/netcdf-3.6.2/nf_test/test_put.F:1628: undefined reference to 
`_nf_put_var1_int_'
/home/auroux/netcdf-3.6.2/nf_test/test_put.F:1632: undefined reference to 
`_nf_put_var1_int_'
/home/auroux/netcdf-3.6.2/nf_test/test_put.F:1639: undefined reference to 
`_nf_put_var1_int_'
/home/auroux/netcdf-3.6.2/nf_test/test_put.F:1674: undefined reference to 
`_nf_close_'
/home/auroux/netcdf-3.6.2/nf_test/test_put.F:1680: undefined reference to 
`_nf_delete_'
/home/auroux/netcdf-3.6.2/nf_test/test_put.F:1657: undefined reference to 
`_nf_put_var1_int_'
/home/auroux/netcdf-3.6.2/nf_test/test_put.F:1662: undefined reference to 
`_nf_strerror_'
test_put.o: In function `test_nf_put_var1_int2_':
/home/auroux/netcdf-3.6.2/nf_test/test_put.F:1521: undefined reference to 
`_nf_create_'
/home/auroux/netcdf-3.6.2/nf_test/test_put.F:1528: undefined reference to 
`_nf_enddef_'
/home/auroux/netcdf-3.6.2/nf_test/test_put.F:1538: undefined reference to 
`_nf_put_var1_int2_'
/home/auroux/netcdf-3.6.2/nf_test/test_put.F:1542: undefined reference to 
`_nf_put_var1_int2_'
/home/auroux/netcdf-3.6.2/nf_test/test_put.F:1549: undefined reference to 
`_nf_put_var1_int2_'
/home/auroux/netcdf-3.6.2/nf_test/test_put.F:1584: undefined reference to 
`_nf_close_'
/home/auroux/netcdf-3.6.2/nf_test/test_put.F:1590: undefined reference to 
`_nf_delete_'
/home/auroux/netcdf-3.6.2/nf_test/test_put.F:1567: undefined reference to 
`_nf_put_var1_int2_'
/home/auroux/netcdf-3.6.2/nf_test/test_put.F:1572: undefined reference to 
`_nf_strerror_'
test_put.o: In function `test_nf_put_var1_int1_':
/home/auroux/netcdf-3.6.2/nf_test/test_put.F:1430: undefined reference to 
`_nf_create_'
/home/auroux/netcdf-3.6.2/nf_test/test_put.F:1437: undefined reference to 
`_nf_enddef_'
/home/auroux/netcdf-3.6.2/nf_test/test_put.F:1447: undefined reference to 
`_nf_put_var1_int1_'
/home/auroux/netcdf-3.6.2/nf_test/test_put.F:1451: undefined reference to 
`_nf_put_var1_int1_'
/home/auroux/netcdf-3.6.2/nf_test/test_put.F:1458: undefined reference to 
`_nf_put_var1_int1_'
/home/auroux/netcdf-3.6.2/nf_test/test_put.F:1493: undefined reference to 
`_nf_close_'
/home/auroux/netcdf-3.6.2/nf_test/test_put.F:1499: undefined reference to 
`_nf_delete_'
/home/auroux/netcdf-3.6.2/nf_test/test_put.F:1476: undefined reference to 
`_nf_put_var1_int1_'
/home/auroux/netcdf-3.6.2/nf_test/test_put.F:1481: undefined reference to 
`_nf_strerror_'
test_put.o: In function `test_nf_put_var1_text_':
/home/auroux/netcdf-3.6.2/nf_test/test_put.F:1340: undefined reference to 
`_nf_create_'
/home/auroux/netcdf-3.6.2/nf_test/test_put.F:1347: undefined reference to 
`_nf_enddef_'
/home/auroux/netcdf-3.6.2/nf_test/test_put.F:1357: undefined reference to 
`_nf_put_var1_text_'
/home/auroux/netcdf-3.6.2/nf_test/test_put.F:1361: undefined reference to 
`_nf_put_var1_text_'
/home/auroux/netcdf-3.6.2/nf_test/test_put.F:1368: undefined reference to 
`_nf_put_var1_text_'
/home/auroux/netcdf-3.6.2/nf_test/test_put.F:1403: undefined reference to 
`_nf_close_'
/home/auroux/netcdf-3.6.2/nf_test/test_put.F:1409: undefined reference to 
`_nf_delete_'
/home/auroux/netcdf-3.6.2/nf_test/test_put.F:1386: undefined reference to 
`_nf_put_var1_text_'
/home/auroux/netcdf-3.6.2/nf_test/test_put.F:1391: undefined reference to 
`_nf_strerror_'
test_put.o: In function `check_atts_double_':
/home/auroux/netcdf-3.6.2/nf_test/test_put.F:1259: undefined reference to 
`_nf_inq_att_'
/home/auroux/netcdf-3.6.2/nf_test/test_put.F:1283: undefined reference to 
`_nf_get_att_double_'
/home/auroux/netcdf-3.6.2/nf_test/test_put.F:1287: undefined reference to 
`_nf_strerror_'
/home/auroux/netcdf-3.6.2/nf_test/test_put.F:1267: undefined reference to 
`__gfortran_stop_string'
test_put.o: In function `check_atts_real_':
/home/auroux/netcdf-3.6.2/nf_test/test_put.F:1162: undefined reference to 
`_nf_inq_att_'
/home/auroux/netcdf-3.6.2/nf_test/test_put.F:1186: undefined reference to 
`_nf_get_att_real_'
/home/auroux/netcdf-3.6.2/nf_test/test_put.F:1190: undefined reference to 
`_nf_strerror_'
/home/auroux/netcdf-3.6.2/nf_test/test_put.F:1170: undefined reference to 
`__gfortran_stop_string'
test_put.o: In function `check_atts_int_':
/home/auroux/netcdf-3.6.2/nf_test/test_put.F:1065: undefined reference to 
`_nf_inq_att_'
/home/auroux/netcdf-3.6.2/nf_test/test_put.F:1089: undefined reference to 
`_nf_get_att_int_'
/home/auroux/netcdf-3.6.2/nf_test/test_put.F:1093: undefined reference to 
`_nf_strerror_'
/home/auroux/netcdf-3.6.2/nf_test/test_put.F:1073: undefined reference to 
`__gfortran_stop_string'
test_put.o: In function `check_atts_int2_':
/home/auroux/netcdf-3.6.2/nf_test/test_put.F:967: undefined reference to 
`_nf_inq_att_'
/home/auroux/netcdf-3.6.2/nf_test/test_put.F:991: undefined reference to 
`_nf_get_att_int2_'
/home/auroux/netcdf-3.6.2/nf_test/test_put.F:995: undefined reference to 
`_nf_strerror_'
/home/auroux/netcdf-3.6.2/nf_test/test_put.F:975: undefined reference to 
`__gfortran_stop_string'
test_put.o: In function `check_atts_int1_':
/home/auroux/netcdf-3.6.2/nf_test/test_put.F:868: undefined reference to 
`_nf_inq_att_'
/home/auroux/netcdf-3.6.2/nf_test/test_put.F:892: undefined reference to 
`_nf_get_att_int1_'
/home/auroux/netcdf-3.6.2/nf_test/test_put.F:896: undefined reference to 
`_nf_strerror_'
/home/auroux/netcdf-3.6.2/nf_test/test_put.F:876: undefined reference to 
`__gfortran_stop_string'
test_put.o: In function `check_atts_text_':
/home/auroux/netcdf-3.6.2/nf_test/test_put.F:770: undefined reference to 
`_nf_inq_att_'
/home/auroux/netcdf-3.6.2/nf_test/test_put.F:794: undefined reference to 
`_nf_get_att_text_'
/home/auroux/netcdf-3.6.2/nf_test/test_put.F:798: undefined reference to 
`_nf_strerror_'
/home/auroux/netcdf-3.6.2/nf_test/test_put.F:778: undefined reference to 
`__gfortran_stop_string'
test_put.o: In function `check_vars_double_':
/home/auroux/netcdf-3.6.2/nf_test/test_put.F:665: undefined reference to 
`_nf_open_'
/home/auroux/netcdf-3.6.2/nf_test/test_put.F:674: undefined reference to 
`_nf_inq_var_'
/home/auroux/netcdf-3.6.2/nf_test/test_put.F:678: undefined reference to 
`__gfortran_compare_string'
/home/auroux/netcdf-3.6.2/nf_test/test_put.F:684: undefined reference to 
`_nf_inq_dim_'
/home/auroux/netcdf-3.6.2/nf_test/test_put.F:732: undefined reference to 
`_nf_close_'
/home/auroux/netcdf-3.6.2/nf_test/test_put.F:697: undefined reference to 
`_nf_get_var1_double_'
test_put.o: In function `check_vars_real_':
/home/auroux/netcdf-3.6.2/nf_test/test_put.F:565: undefined reference to 
`_nf_open_'
/home/auroux/netcdf-3.6.2/nf_test/test_put.F:574: undefined reference to 
`_nf_inq_var_'
/home/auroux/netcdf-3.6.2/nf_test/test_put.F:578: undefined reference to 
`__gfortran_compare_string'
/home/auroux/netcdf-3.6.2/nf_test/test_put.F:584: undefined reference to 
`_nf_inq_dim_'
/home/auroux/netcdf-3.6.2/nf_test/test_put.F:632: undefined reference to 
`_nf_close_'
/home/auroux/netcdf-3.6.2/nf_test/test_put.F:597: undefined reference to 
`_nf_get_var1_real_'
test_put.o: In function `check_vars_int_':
/home/auroux/netcdf-3.6.2/nf_test/test_put.F:465: undefined reference to 
`_nf_open_'
/home/auroux/netcdf-3.6.2/nf_test/test_put.F:474: undefined reference to 
`_nf_inq_var_'
/home/auroux/netcdf-3.6.2/nf_test/test_put.F:478: undefined reference to 
`__gfortran_compare_string'
/home/auroux/netcdf-3.6.2/nf_test/test_put.F:484: undefined reference to 
`_nf_inq_dim_'
/home/auroux/netcdf-3.6.2/nf_test/test_put.F:532: undefined reference to 
`_nf_close_'
/home/auroux/netcdf-3.6.2/nf_test/test_put.F:497: undefined reference to 
`_nf_get_var1_int_'
test_put.o: In function `check_vars_int2_':
/home/auroux/netcdf-3.6.2/nf_test/test_put.F:364: undefined reference to 
`_nf_open_'
/home/auroux/netcdf-3.6.2/nf_test/test_put.F:373: undefined reference to 
`_nf_inq_var_'
/home/auroux/netcdf-3.6.2/nf_test/test_put.F:377: undefined reference to 
`__gfortran_compare_string'
/home/auroux/netcdf-3.6.2/nf_test/test_put.F:383: undefined reference to 
`_nf_inq_dim_'
/home/auroux/netcdf-3.6.2/nf_test/test_put.F:431: undefined reference to 
`_nf_close_'
/home/auroux/netcdf-3.6.2/nf_test/test_put.F:396: undefined reference to 
`_nf_get_var1_int2_'
test_put.o: In function `check_vars_int1_':
/home/auroux/netcdf-3.6.2/nf_test/test_put.F:262: undefined reference to 
`_nf_open_'
/home/auroux/netcdf-3.6.2/nf_test/test_put.F:271: undefined reference to 
`_nf_inq_var_'
/home/auroux/netcdf-3.6.2/nf_test/test_put.F:275: undefined reference to 
`__gfortran_compare_string'
/home/auroux/netcdf-3.6.2/nf_test/test_put.F:281: undefined reference to 
`_nf_inq_dim_'
/home/auroux/netcdf-3.6.2/nf_test/test_put.F:329: undefined reference to 
`_nf_close_'
/home/auroux/netcdf-3.6.2/nf_test/test_put.F:294: undefined reference to 
`_nf_get_var1_int1_'
test_put.o: In function `check_vars_text_':
/home/auroux/netcdf-3.6.2/nf_test/test_put.F:161: undefined reference to 
`_nf_open_'
/home/auroux/netcdf-3.6.2/nf_test/test_put.F:170: undefined reference to 
`_nf_inq_var_'
/home/auroux/netcdf-3.6.2/nf_test/test_put.F:174: undefined reference to 
`__gfortran_compare_string'
/home/auroux/netcdf-3.6.2/nf_test/test_put.F:180: undefined reference to 
`_nf_inq_dim_'
/home/auroux/netcdf-3.6.2/nf_test/test_put.F:193: undefined reference to 
`_nf_get_var1_text_'
/home/auroux/netcdf-3.6.2/nf_test/test_put.F:228: undefined reference to 
`_nf_close_'
nf_error.o: In function `errore_':
/home/auroux/netcdf-3.6.2/nf_test/nf_error.F:74: undefined reference to 
`_nf_strerror_'
nf_error.o: In function `errorc_':
/home/auroux/netcdf-3.6.2/nf_test/nf_error.F:60: undefined reference to 
`__gfortran_st_write'
/home/auroux/netcdf-3.6.2/nf_test/nf_error.F:59: undefined reference to 
`__gfortran_transfer_character'
/home/auroux/netcdf-3.6.2/nf_test/nf_error.F:60: undefined reference to 
`__gfortran_string_len_trim'
/home/auroux/netcdf-3.6.2/nf_test/nf_error.F:60: undefined reference to 
`__gfortran_transfer_character'
/home/auroux/netcdf-3.6.2/nf_test/nf_error.F:60: undefined reference to 
`__gfortran_st_write_done'
nf_error.o: In function `error_':
/home/auroux/netcdf-3.6.2/nf_test/nf_error.F:17: undefined reference to 
`__gfortran_st_write'
/home/auroux/netcdf-3.6.2/nf_test/nf_error.F:17: undefined reference to 
`__gfortran_transfer_character'
/home/auroux/netcdf-3.6.2/nf_test/nf_error.F:17: undefined reference to 
`__gfortran_st_write_done'
nf_error.o: In function `errord_':
/home/auroux/netcdf-3.6.2/nf_test/nf_error.F:45: undefined reference to 
`__gfortran_st_write'
/home/auroux/netcdf-3.6.2/nf_test/nf_error.F:45: undefined reference to 
`__gfortran_transfer_character'
/home/auroux/netcdf-3.6.2/nf_test/nf_error.F:45: undefined reference to 
`__gfortran_transfer_real'
/home/auroux/netcdf-3.6.2/nf_test/nf_error.F:45: undefined reference to 
`__gfortran_st_write_done'
nf_error.o: In function `errori_':
/home/auroux/netcdf-3.6.2/nf_test/nf_error.F:31: undefined reference to 
`__gfortran_st_write'
/home/auroux/netcdf-3.6.2/nf_test/nf_error.F:31: undefined reference to 
`__gfortran_transfer_character'
/home/auroux/netcdf-3.6.2/nf_test/nf_error.F:31: undefined reference to 
`__gfortran_transfer_integer'
/home/auroux/netcdf-3.6.2/nf_test/nf_error.F:31: undefined reference to 
`__gfortran_st_write_done'
nf_test.o: In function `test_':
/home/auroux/netcdf-3.6.2/nf_test/nf_test.F:16: undefined reference to 
`__gfortran_st_write'
/home/auroux/netcdf-3.6.2/nf_test/nf_test.F:16: undefined reference to 
`__gfortran_transfer_character'
/home/auroux/netcdf-3.6.2/nf_test/nf_test.F:16: undefined reference to 
`__gfortran_st_write_done'
/home/auroux/netcdf-3.6.2/nf_test/nf_test.F:22: undefined reference to 
`__gfortran_st_write'
/home/auroux/netcdf-3.6.2/nf_test/nf_test.F:22: undefined reference to 
`__gfortran_transfer_character'
/home/auroux/netcdf-3.6.2/nf_test/nf_test.F:22: undefined reference to 
`__gfortran_st_write_done'
/home/auroux/netcdf-3.6.2/nf_test/nf_test.F:24: undefined reference to 
`__gfortran_st_write'
/home/auroux/netcdf-3.6.2/nf_test/nf_test.F:23: undefined reference to 
`__gfortran_transfer_character'
/home/auroux/netcdf-3.6.2/nf_test/nf_test.F:23: undefined reference to 
`__gfortran_transfer_integer'
/home/auroux/netcdf-3.6.2/nf_test/nf_test.F:23: undefined reference to 
`__gfortran_transfer_character'
/home/auroux/netcdf-3.6.2/nf_test/nf_test.F:23: undefined reference to 
`__gfortran_transfer_character'
/home/auroux/netcdf-3.6.2/nf_test/nf_test.F:24: undefined reference to 
`__gfortran_transfer_character'
/home/auroux/netcdf-3.6.2/nf_test/nf_test.F:24: undefined reference to 
`__gfortran_st_write_done'
nf_test.o: In function `MAIN__':
/home/auroux/netcdf-3.6.2/nf_test/nf_test.F:28: undefined reference to 
`__gfortran_set_std'
/home/auroux/netcdf-3.6.2/nf_test/nf_test.F:196: undefined reference to 
`__gfortran_st_write'
/home/auroux/netcdf-3.6.2/nf_test/nf_test.F:196: undefined reference to 
`__gfortran_transfer_character'
/home/auroux/netcdf-3.6.2/nf_test/nf_test.F:196: undefined reference to 
`__gfortran_st_write_done'
/home/auroux/netcdf-3.6.2/nf_test/nf_test.F:213: undefined reference to 
`_nf_delete_'
/home/auroux/netcdf-3.6.2/nf_test/nf_test.F:379: undefined reference to 
`__gfortran_st_write'
/home/auroux/netcdf-3.6.2/nf_test/nf_test.F:379: undefined reference to 
`__gfortran_transfer_character'
/home/auroux/netcdf-3.6.2/nf_test/nf_test.F:379: undefined reference to 
`__gfortran_transfer_integer'
/home/auroux/netcdf-3.6.2/nf_test/nf_test.F:379: undefined reference to 
`__gfortran_st_write_done'
/home/auroux/netcdf-3.6.2/nf_test/nf_test.F:381: undefined reference to 
`__gfortran_st_write'
/home/auroux/netcdf-3.6.2/nf_test/nf_test.F:381: undefined reference to 
`__gfortran_transfer_character'
/home/auroux/netcdf-3.6.2/nf_test/nf_test.F:381: undefined reference to 
`__gfortran_st_write_done'
/home/auroux/netcdf-3.6.2/nf_test/nf_test.F:380: undefined reference to 
`__gfortran_stop_numeric'
test_read.o: In function `test_nf_inq_attid_':
/home/auroux/netcdf-3.6.2/nf_test/test_read.F:1031: undefined reference to 
`_nf_open_'
/home/auroux/netcdf-3.6.2/nf_test/test_read.F:1036: undefined reference to 
`_nf_inq_attid_'
/home/auroux/netcdf-3.6.2/nf_test/test_read.F:1040: undefined reference to 
`_nf_inq_attid_'
/home/auroux/netcdf-3.6.2/nf_test/test_read.F:1044: undefined reference to 
`_nf_inq_attid_'
/home/auroux/netcdf-3.6.2/nf_test/test_read.F:1047: undefined reference to 
`_nf_inq_attid_'
/home/auroux/netcdf-3.6.2/nf_test/test_read.F:1049: undefined reference to 
`_nf_strerror_'
/home/auroux/netcdf-3.6.2/nf_test/test_read.F:1057: undefined reference to 
`_nf_close_'
test_read.o: In function `test_nf_inq_attname_':
/home/auroux/netcdf-3.6.2/nf_test/test_read.F:988: undefined reference to 
`_nf_open_'
/home/auroux/netcdf-3.6.2/nf_test/test_read.F:993: undefined reference to 
`_nf_inq_attname_'
/home/auroux/netcdf-3.6.2/nf_test/test_read.F:996: undefined reference to 
`_nf_inq_attname_'
/home/auroux/netcdf-3.6.2/nf_test/test_read.F:1008: undefined reference to 
`_nf_strerror_'
/home/auroux/netcdf-3.6.2/nf_test/test_read.F:1000: undefined reference to 
`_nf_inq_attname_'
/home/auroux/netcdf-3.6.2/nf_test/test_read.F:1003: undefined reference to 
`_nf_inq_attname_'
/home/auroux/netcdf-3.6.2/nf_test/test_read.F:1006: undefined reference to 
`_nf_inq_attname_'
/home/auroux/netcdf-3.6.2/nf_test/test_read.F:1011: undefined reference to 
`__gfortran_compare_string'
/home/auroux/netcdf-3.6.2/nf_test/test_read.F:1016: undefined reference to 
`_nf_close_'
test_read.o: In function `test_nf_inq_atttype_':
/home/auroux/netcdf-3.6.2/nf_test/test_read.F:947: undefined reference to 
`_nf_open_'
/home/auroux/netcdf-3.6.2/nf_test/test_read.F:952: undefined reference to 
`_nf_inq_atttype_'
/home/auroux/netcdf-3.6.2/nf_test/test_read.F:965: undefined reference to 
`_nf_strerror_'
/home/auroux/netcdf-3.6.2/nf_test/test_read.F:956: undefined reference to 
`_nf_inq_atttype_'
/home/auroux/netcdf-3.6.2/nf_test/test_read.F:960: undefined reference to 
`_nf_inq_atttype_'
/home/auroux/netcdf-3.6.2/nf_test/test_read.F:963: undefined reference to 
`_nf_inq_atttype_'
/home/auroux/netcdf-3.6.2/nf_test/test_read.F:973: undefined reference to 
`_nf_close_'
test_read.o: In function `test_nf_inq_attlen_':
/home/auroux/netcdf-3.6.2/nf_test/test_read.F:907: undefined reference to 
`_nf_open_'
/home/auroux/netcdf-3.6.2/nf_test/test_read.F:912: undefined reference to 
`_nf_inq_attlen_'
/home/auroux/netcdf-3.6.2/nf_test/test_read.F:924: undefined reference to 
`_nf_strerror_'
/home/auroux/netcdf-3.6.2/nf_test/test_read.F:916: undefined reference to 
`_nf_inq_attlen_'
/home/auroux/netcdf-3.6.2/nf_test/test_read.F:919: undefined reference to 
`_nf_inq_attlen_'
/home/auroux/netcdf-3.6.2/nf_test/test_read.F:922: undefined reference to 
`_nf_inq_attlen_'
/home/auroux/netcdf-3.6.2/nf_test/test_read.F:932: undefined reference to 
`_nf_close_'
test_read.o: In function `test_nf_inq_att_':
/home/auroux/netcdf-3.6.2/nf_test/test_read.F:865: undefined reference to 
`_nf_open_'
/home/auroux/netcdf-3.6.2/nf_test/test_read.F:882: undefined reference to 
`_nf_strerror_'
/home/auroux/netcdf-3.6.2/nf_test/test_read.F:871: undefined reference to 
`_nf_inq_att_'
/home/auroux/netcdf-3.6.2/nf_test/test_read.F:874: undefined reference to 
`_nf_inq_att_'
/home/auroux/netcdf-3.6.2/nf_test/test_read.F:877: undefined reference to 
`_nf_inq_att_'
/home/auroux/netcdf-3.6.2/nf_test/test_read.F:880: undefined reference to 
`_nf_inq_att_'
/home/auroux/netcdf-3.6.2/nf_test/test_read.F:892: undefined reference to 
`_nf_close_'
test_read.o: In function `test_nf_inq_vartype_':
/home/auroux/netcdf-3.6.2/nf_test/test_read.F:832: undefined reference to 
`_nf_open_'
/home/auroux/netcdf-3.6.2/nf_test/test_read.F:836: undefined reference to 
`_nf_inq_vartype_'
/home/auroux/netcdf-3.6.2/nf_test/test_read.F:839: undefined reference to 
`_nf_inq_vartype_'
/home/auroux/netcdf-3.6.2/nf_test/test_read.F:842: undefined reference to 
`_nf_inq_vartype_'
/home/auroux/netcdf-3.6.2/nf_test/test_read.F:849: undefined reference to 
`_nf_close_'
test_read.o: In function `test_nf_inq_varndims_':
/home/auroux/netcdf-3.6.2/nf_test/test_read.F:801: undefined reference to 
`_nf_open_'
/home/auroux/netcdf-3.6.2/nf_test/test_read.F:805: undefined reference to 
`_nf_inq_varndims_'
/home/auroux/netcdf-3.6.2/nf_test/test_read.F:808: undefined reference to 
`_nf_inq_varndims_'
/home/auroux/netcdf-3.6.2/nf_test/test_read.F:811: undefined reference to 
`_nf_inq_varndims_'
/home/auroux/netcdf-3.6.2/nf_test/test_read.F:818: undefined reference to 
`_nf_close_'
test_read.o: In function `test_nf_inq_varnatts_':
/home/auroux/netcdf-3.6.2/nf_test/test_read.F:770: undefined reference to 
`_nf_open_'
/home/auroux/netcdf-3.6.2/nf_test/test_read.F:774: undefined reference to 
`_nf_inq_varnatts_'
/home/auroux/netcdf-3.6.2/nf_test/test_read.F:777: undefined reference to 
`_nf_inq_varnatts_'
/home/auroux/netcdf-3.6.2/nf_test/test_read.F:780: undefined reference to 
`_nf_inq_varnatts_'
/home/auroux/netcdf-3.6.2/nf_test/test_read.F:787: undefined reference to 
`_nf_close_'
test_read.o: In function `test_nf_inq_varname_':
/home/auroux/netcdf-3.6.2/nf_test/test_read.F:739: undefined reference to 
`_nf_open_'
/home/auroux/netcdf-3.6.2/nf_test/test_read.F:743: undefined reference to 
`_nf_inq_varname_'
/home/auroux/netcdf-3.6.2/nf_test/test_read.F:746: undefined reference to 
`_nf_inq_varname_'
/home/auroux/netcdf-3.6.2/nf_test/test_read.F:749: undefined reference to 
`_nf_inq_varname_'
/home/auroux/netcdf-3.6.2/nf_test/test_read.F:750: undefined reference to 
`__gfortran_compare_string'
/home/auroux/netcdf-3.6.2/nf_test/test_read.F:756: undefined reference to 
`_nf_close_'
test_read.o: In function `test_nf_inq_vardimid_':
/home/auroux/netcdf-3.6.2/nf_test/test_read.F:707: undefined reference to 
`_nf_open_'
/home/auroux/netcdf-3.6.2/nf_test/test_read.F:711: undefined reference to 
`_nf_inq_vardimid_'
/home/auroux/netcdf-3.6.2/nf_test/test_read.F:714: undefined reference to 
`_nf_inq_vardimid_'
/home/auroux/netcdf-3.6.2/nf_test/test_read.F:717: undefined reference to 
`_nf_inq_vardimid_'
/home/auroux/netcdf-3.6.2/nf_test/test_read.F:725: undefined reference to 
`_nf_close_'
test_read.o: In function `test_nf_inq_var_':
/home/auroux/netcdf-3.6.2/nf_test/test_read.F:665: undefined reference to 
`_nf_open_'
/home/auroux/netcdf-3.6.2/nf_test/test_read.F:670: undefined reference to 
`_nf_inq_var_'
/home/auroux/netcdf-3.6.2/nf_test/test_read.F:674: undefined reference to 
`_nf_inq_var_'
/home/auroux/netcdf-3.6.2/nf_test/test_read.F:678: undefined reference to 
`_nf_inq_var_'
/home/auroux/netcdf-3.6.2/nf_test/test_read.F:679: undefined reference to 
`__gfortran_compare_string'
/home/auroux/netcdf-3.6.2/nf_test/test_read.F:693: undefined reference to 
`_nf_close_'
test_read.o: In function `test_nf_inq_varid_':
/home/auroux/netcdf-3.6.2/nf_test/test_read.F:627: undefined reference to 
`_nf_open_'
/home/auroux/netcdf-3.6.2/nf_test/test_read.F:631: undefined reference to 
`_nf_inq_varid_'
/home/auroux/netcdf-3.6.2/nf_test/test_read.F:636: undefined reference to 
`_nf_inq_varid_'
/home/auroux/netcdf-3.6.2/nf_test/test_read.F:639: undefined reference to 
`_nf_inq_varid_'
/home/auroux/netcdf-3.6.2/nf_test/test_read.F:647: undefined reference to 
`_nf_close_'
test_read.o: In function `test_nf_inq_dimname_':
/home/auroux/netcdf-3.6.2/nf_test/test_read.F:596: undefined reference to 
`_nf_open_'
/home/auroux/netcdf-3.6.2/nf_test/test_read.F:600: undefined reference to 
`_nf_inq_dimname_'
/home/auroux/netcdf-3.6.2/nf_test/test_read.F:603: undefined reference to 
`_nf_inq_dimname_'
/home/auroux/netcdf-3.6.2/nf_test/test_read.F:606: undefined reference to 
`_nf_inq_dimname_'
/home/auroux/netcdf-3.6.2/nf_test/test_read.F:607: undefined reference to 
`__gfortran_compare_string'
/home/auroux/netcdf-3.6.2/nf_test/test_read.F:613: undefined reference to 
`_nf_close_'
test_read.o: In function `test_nf_inq_dimlen_':
/home/auroux/netcdf-3.6.2/nf_test/test_read.F:565: undefined reference to 
`_nf_open_'
/home/auroux/netcdf-3.6.2/nf_test/test_read.F:569: undefined reference to 
`_nf_inq_dimlen_'
/home/auroux/netcdf-3.6.2/nf_test/test_read.F:572: undefined reference to 
`_nf_inq_dimlen_'
/home/auroux/netcdf-3.6.2/nf_test/test_read.F:575: undefined reference to 
`_nf_inq_dimlen_'
/home/auroux/netcdf-3.6.2/nf_test/test_read.F:582: undefined reference to 
`_nf_close_'
test_read.o: In function `test_nf_inq_dim_':
/home/auroux/netcdf-3.6.2/nf_test/test_read.F:532: undefined reference to 
`_nf_open_'
/home/auroux/netcdf-3.6.2/nf_test/test_read.F:536: undefined reference to 
`_nf_inq_dim_'
/home/auroux/netcdf-3.6.2/nf_test/test_read.F:539: undefined reference to 
`_nf_inq_dim_'
/home/auroux/netcdf-3.6.2/nf_test/test_read.F:542: undefined reference to 
`_nf_inq_dim_'
/home/auroux/netcdf-3.6.2/nf_test/test_read.F:543: undefined reference to 
`__gfortran_compare_string'
/home/auroux/netcdf-3.6.2/nf_test/test_read.F:551: undefined reference to 
`_nf_close_'
test_read.o: In function `test_nf_inq_dimid_':
/home/auroux/netcdf-3.6.2/nf_test/test_read.F:499: undefined reference to 
`_nf_open_'
/home/auroux/netcdf-3.6.2/nf_test/test_read.F:502: undefined reference to 
`_nf_inq_dimid_'
/home/auroux/netcdf-3.6.2/nf_test/test_read.F:506: undefined reference to 
`_nf_inq_dimid_'
/home/auroux/netcdf-3.6.2/nf_test/test_read.F:509: undefined reference to 
`_nf_inq_dimid_'
/home/auroux/netcdf-3.6.2/nf_test/test_read.F:517: undefined reference to 
`_nf_close_'
test_read.o: In function `test_nf_inq_format_':
/home/auroux/netcdf-3.6.2/nf_test/test_read.F:471: undefined reference to 
`_nf_inq_format_'
/home/auroux/netcdf-3.6.2/nf_test/test_read.F:474: undefined reference to 
`_nf_open_'
/home/auroux/netcdf-3.6.2/nf_test/test_read.F:477: undefined reference to 
`_nf_inq_format_'
/home/auroux/netcdf-3.6.2/nf_test/test_read.F:485: undefined reference to 
`_nf_close_'
test_read.o: In function `test_nf_inq_unlimdim_':
/home/auroux/netcdf-3.6.2/nf_test/test_read.F:445: undefined reference to 
`_nf_inq_unlimdim_'
/home/auroux/netcdf-3.6.2/nf_test/test_read.F:448: undefined reference to 
`_nf_open_'
/home/auroux/netcdf-3.6.2/nf_test/test_read.F:451: undefined reference to 
`_nf_inq_unlimdim_'
/home/auroux/netcdf-3.6.2/nf_test/test_read.F:458: undefined reference to 
`_nf_close_'
test_read.o: In function `test_nf_inq_nvars_':
/home/auroux/netcdf-3.6.2/nf_test/test_read.F:420: undefined reference to 
`_nf_inq_nvars_'
/home/auroux/netcdf-3.6.2/nf_test/test_read.F:423: undefined reference to 
`_nf_open_'
/home/auroux/netcdf-3.6.2/nf_test/test_read.F:426: undefined reference to 
`_nf_inq_nvars_'
/home/auroux/netcdf-3.6.2/nf_test/test_read.F:432: undefined reference to 
`_nf_close_'
test_read.o: In function `test_nf_inq_ndims_':
/home/auroux/netcdf-3.6.2/nf_test/test_read.F:395: undefined reference to 
`_nf_inq_ndims_'
/home/auroux/netcdf-3.6.2/nf_test/test_read.F:398: undefined reference to 
`_nf_open_'
/home/auroux/netcdf-3.6.2/nf_test/test_read.F:401: undefined reference to 
`_nf_inq_ndims_'
/home/auroux/netcdf-3.6.2/nf_test/test_read.F:407: undefined reference to 
`_nf_close_'
test_read.o: In function `test_nf_inq_natts_':
/home/auroux/netcdf-3.6.2/nf_test/test_read.F:368: undefined reference to 
`_nf_inq_natts_'
/home/auroux/netcdf-3.6.2/nf_test/test_read.F:371: undefined reference to 
`_nf_open_'
/home/auroux/netcdf-3.6.2/nf_test/test_read.F:374: undefined reference to 
`_nf_inq_natts_'
/home/auroux/netcdf-3.6.2/nf_test/test_read.F:382: undefined reference to 
`_nf_close_'
test_read.o: In function `test_nf_inq_':
/home/auroux/netcdf-3.6.2/nf_test/test_read.F:247: undefined reference to 
`_nf_open_'
/home/auroux/netcdf-3.6.2/nf_test/test_read.F:252: undefined reference to 
`_nf_inq_'
/home/auroux/netcdf-3.6.2/nf_test/test_read.F:256: undefined reference to 
`_nf_inq_'
/home/auroux/netcdf-3.6.2/nf_test/test_read.F:355: undefined reference to 
`_nf_close_'
/home/auroux/netcdf-3.6.2/nf_test/test_read.F:275: undefined reference to 
`_nf_create_'
/home/auroux/netcdf-3.6.2/nf_test/test_read.F:279: undefined reference to 
`_nf_enddef_'
/home/auroux/netcdf-3.6.2/nf_test/test_read.F:280: undefined reference to 
`_nf_inq_'
/home/auroux/netcdf-3.6.2/nf_test/test_read.F:283: undefined reference to 
`_nf_redef_'
/home/auroux/netcdf-3.6.2/nf_test/test_read.F:285: undefined reference to 
`_nf_inq_'
/home/auroux/netcdf-3.6.2/nf_test/test_read.F:303: undefined reference to 
`_nf_def_dim_'
/home/auroux/netcdf-3.6.2/nf_test/test_read.F:306: undefined reference to 
`_nf_def_var_'
/home/auroux/netcdf-3.6.2/nf_test/test_read.F:311: undefined reference to 
`_nf_put_att_text_'
/home/auroux/netcdf-3.6.2/nf_test/test_read.F:316: undefined reference to 
`_nf_inq_'
/home/auroux/netcdf-3.6.2/nf_test/test_read.F:329: undefined reference to 
`_nf_enddef_'
/home/auroux/netcdf-3.6.2/nf_test/test_read.F:334: undefined reference to 
`_nf_inq_'
/home/auroux/netcdf-3.6.2/nf_test/test_read.F:347: undefined reference to 
`_nf_close_'
/home/auroux/netcdf-3.6.2/nf_test/test_read.F:348: undefined reference to 
`_nf_delete_'
test_read.o: In function `test_nf_close_':
/home/auroux/netcdf-3.6.2/nf_test/test_read.F:181: undefined reference to 
`_nf_open_'
/home/auroux/netcdf-3.6.2/nf_test/test_read.F:186: undefined reference to 
`_nf_close_'
/home/auroux/netcdf-3.6.2/nf_test/test_read.F:189: undefined reference to 
`_nf_close_'
/home/auroux/netcdf-3.6.2/nf_test/test_read.F:194: undefined reference to 
`_nf_close_'
/home/auroux/netcdf-3.6.2/nf_test/test_read.F:201: undefined reference to 
`_nf_open_'
/home/auroux/netcdf-3.6.2/nf_test/test_read.F:204: undefined reference to 
`_nf_close_'
/home/auroux/netcdf-3.6.2/nf_test/test_read.F:209: undefined reference to 
`_nf_create_'
/home/auroux/netcdf-3.6.2/nf_test/test_read.F:212: undefined reference to 
`_nf_close_'
/home/auroux/netcdf-3.6.2/nf_test/test_read.F:215: undefined reference to 
`_nf_delete_'
test_read.o: In function `test_nf_open_':
/home/auroux/netcdf-3.6.2/nf_test/test_read.F:115: undefined reference to 
`_nf_open_'
/home/auroux/netcdf-3.6.2/nf_test/test_read.F:120: undefined reference to 
`_nf_issyserr_'
/home/auroux/netcdf-3.6.2/nf_test/test_read.F:123: undefined reference to 
`_nf_open_'
/home/auroux/netcdf-3.6.2/nf_test/test_read.F:128: undefined reference to 
`_nf_open_'
/home/auroux/netcdf-3.6.2/nf_test/test_read.F:131: undefined reference to 
`_nf_redef_'
/home/auroux/netcdf-3.6.2/nf_test/test_read.F:135: undefined reference to 
`_nf_open_'
/home/auroux/netcdf-3.6.2/nf_test/test_read.F:163: undefined reference to 
`_nf_close_'
/home/auroux/netcdf-3.6.2/nf_test/test_read.F:139: undefined reference to 
`_nf_close_'
/home/auroux/netcdf-3.6.2/nf_test/test_read.F:146: undefined reference to 
`_nf_create_'
/home/auroux/netcdf-3.6.2/nf_test/test_read.F:150: undefined reference to 
`_nf_close_'
/home/auroux/netcdf-3.6.2/nf_test/test_read.F:152: undefined reference to 
`_nf_open_'
/home/auroux/netcdf-3.6.2/nf_test/test_read.F:158: undefined reference to 
`_nf_delete_'
/home/auroux/netcdf-3.6.2/nf_test/test_read.F:156: undefined reference to 
`_nf_close_'
test_read.o: In function `test_nf_strerror_':
/home/auroux/netcdf-3.6.2/nf_test/test_read.F:82: undefined reference to 
`_nf_strerror_'
/home/auroux/netcdf-3.6.2/nf_test/test_read.F:85: undefined reference to 
`__gfortran_compare_string'
/home/auroux/netcdf-3.6.2/nf_test/test_read.F:89: undefined reference to 
`_nf_strerror_'
/home/auroux/netcdf-3.6.2/nf_test/test_read.F:92: undefined reference to 
`__gfortran_compare_string'
/home/auroux/netcdf-3.6.2/nf_test/test_read.F:92: undefined reference to 
`__gfortran_concat_string'
/home/auroux/netcdf-3.6.2/nf_test/test_read.F:92: undefined reference to 
`__gfortran_concat_string'
test_write.o: In function `nf_get_file_version_':
/home/auroux/netcdf-3.6.2/nf_test/test_write.F:1410: undefined reference to 
`__gfortran_st_open'
/home/auroux/netcdf-3.6.2/nf_test/test_write.F:1417: undefined reference to 
`__gfortran_st_read'
/home/auroux/netcdf-3.6.2/nf_test/test_write.F:1417: undefined reference to 
`__gfortran_transfer_character'
/home/auroux/netcdf-3.6.2/nf_test/test_write.F:1417: undefined reference to 
`__gfortran_st_read_done'
/home/auroux/netcdf-3.6.2/nf_test/test_write.F:1420: undefined reference to 
`__gfortran_string_index'
/home/auroux/netcdf-3.6.2/nf_test/test_write.F:1431: undefined reference to 
`__gfortran_st_close'
test_write.o: In function `test_nf_set_default_format_':
/home/auroux/netcdf-3.6.2/nf_test/test_write.F:1369: undefined reference to 
`_nf_set_default_format_'
/home/auroux/netcdf-3.6.2/nf_test/test_write.F:1379: undefined reference to 
`_nf_create_'
/home/auroux/netcdf-3.6.2/nf_test/test_write.F:1382: undefined reference to 
`_nf_put_att_text_'
/home/auroux/netcdf-3.6.2/nf_test/test_write.F:1384: undefined reference to 
`_nf_close_'
/home/auroux/netcdf-3.6.2/nf_test/test_write.F:1376: undefined reference to 
`_nf_set_default_format_'
test_write.o: In function `test_nf_set_fill_':
/home/auroux/netcdf-3.6.2/nf_test/test_write.F:1172: undefined reference to 
`_nf_set_fill_'
/home/auroux/netcdf-3.6.2/nf_test/test_write.F:1177: undefined reference to 
`_nf_open_'
/home/auroux/netcdf-3.6.2/nf_test/test_write.F:1180: undefined reference to 
`_nf_set_fill_'
/home/auroux/netcdf-3.6.2/nf_test/test_write.F:1183: undefined reference to 
`_nf_close_'
/home/auroux/netcdf-3.6.2/nf_test/test_write.F:1188: undefined reference to 
`_nf_create_'
/home/auroux/netcdf-3.6.2/nf_test/test_write.F:1195: undefined reference to 
`_nf_set_fill_'
/home/auroux/netcdf-3.6.2/nf_test/test_write.F:1200: undefined reference to 
`_nf_set_fill_'
/home/auroux/netcdf-3.6.2/nf_test/test_write.F:1205: undefined reference to 
`_nf_set_fill_'
/home/auroux/netcdf-3.6.2/nf_test/test_write.F:1216: undefined reference to 
`_nf_enddef_'
/home/auroux/netcdf-3.6.2/nf_test/test_write.F:1219: undefined reference to 
`_nf_set_fill_'
/home/auroux/netcdf-3.6.2/nf_test/test_write.F:1227: undefined reference to 
`_nf_inq_varid_'
/home/auroux/netcdf-3.6.2/nf_test/test_write.F:1232: undefined reference to 
`_nf_put_var1_text_'
/home/auroux/netcdf-3.6.2/nf_test/test_write.F:1265: undefined reference to 
`_nf_get_var1_double_'
/home/auroux/netcdf-3.6.2/nf_test/test_write.F:1260: undefined reference to 
`_nf_get_var1_text_'
/home/auroux/netcdf-3.6.2/nf_test/test_write.F:1279: undefined reference to 
`_nf_close_'
/home/auroux/netcdf-3.6.2/nf_test/test_write.F:1282: undefined reference to 
`_nf_create_'
/home/auroux/netcdf-3.6.2/nf_test/test_write.F:1300: undefined reference to 
`_nf_put_att_double_'
/home/auroux/netcdf-3.6.2/nf_test/test_write.F:1295: undefined reference to 
`_nf_put_att_text_'
/home/auroux/netcdf-3.6.2/nf_test/test_write.F:1307: undefined reference to 
`_nf_enddef_'
/home/auroux/netcdf-3.6.2/nf_test/test_write.F:1311: undefined reference to 
`_nf_put_var1_text_'
/home/auroux/netcdf-3.6.2/nf_test/test_write.F:1328: undefined reference to 
`_nf_get_var1_double_'
/home/auroux/netcdf-3.6.2/nf_test/test_write.F:1323: undefined reference to 
`_nf_get_var1_text_'
/home/auroux/netcdf-3.6.2/nf_test/test_write.F:1342: undefined reference to 
`_nf_close_'
/home/auroux/netcdf-3.6.2/nf_test/test_write.F:1345: undefined reference to 
`_nf_delete_'
/home/auroux/netcdf-3.6.2/nf_test/test_write.F:1251: undefined reference to 
`__gfortran_stop_string'
test_write.o: In function `test_nf_del_att_':
/home/auroux/netcdf-3.6.2/nf_test/test_write.F:1046: undefined reference to 
`_nf_create_'
/home/auroux/netcdf-3.6.2/nf_test/test_write.F:1051: undefined reference to 
`_nf_del_att_'
/home/auroux/netcdf-3.6.2/nf_test/test_write.F:1072: undefined reference to 
`_nf_inq_attid_'
/home/auroux/netcdf-3.6.2/nf_test/test_write.F:1084: undefined reference to 
`_nf_inq_varnatts_'
/home/auroux/netcdf-3.6.2/nf_test/test_write.F:1063: undefined reference to 
`_nf_del_att_'
/home/auroux/netcdf-3.6.2/nf_test/test_write.F:1066: undefined reference to 
`_nf_del_att_'
/home/auroux/netcdf-3.6.2/nf_test/test_write.F:1069: undefined reference to 
`_nf_del_att_'
/home/auroux/netcdf-3.6.2/nf_test/test_write.F:1095: undefined reference to 
`_nf_close_'
/home/auroux/netcdf-3.6.2/nf_test/test_write.F:1098: undefined reference to 
`_nf_open_'
/home/auroux/netcdf-3.6.2/nf_test/test_write.F:1101: undefined reference to 
`_nf_inq_natts_'
/home/auroux/netcdf-3.6.2/nf_test/test_write.F:1108: undefined reference to 
`_nf_inq_varnatts_'
/home/auroux/netcdf-3.6.2/nf_test/test_write.F:1076: undefined reference to 
`_nf_inq_natts_'
/home/auroux/netcdf-3.6.2/nf_test/test_write.F:1116: undefined reference to 
`_nf_redef_'
/home/auroux/netcdf-3.6.2/nf_test/test_write.F:1120: undefined reference to 
`_nf_enddef_'
/home/auroux/netcdf-3.6.2/nf_test/test_write.F:1129: undefined reference to 
`_nf_del_att_'
/home/auroux/netcdf-3.6.2/nf_test/test_write.F:1135: undefined reference to 
`_nf_close_'
/home/auroux/netcdf-3.6.2/nf_test/test_write.F:1138: undefined reference to 
`_nf_delete_'
test_write.o: In function `test_nf_rename_att_':
/home/auroux/netcdf-3.6.2/nf_test/test_write.F:896: undefined reference to 
`_nf_create_'
/home/auroux/netcdf-3.6.2/nf_test/test_write.F:901: undefined reference to 
`_nf_rename_att_'
/home/auroux/netcdf-3.6.2/nf_test/test_write.F:922: undefined reference to 
`_nf_inq_attid_'
/home/auroux/netcdf-3.6.2/nf_test/test_write.F:912: undefined reference to 
`_nf_rename_att_'
/home/auroux/netcdf-3.6.2/nf_test/test_write.F:915: undefined reference to 
`_nf_rename_att_'
/home/auroux/netcdf-3.6.2/nf_test/test_write.F:918: undefined reference to 
`__gfortran_concat_string'
/home/auroux/netcdf-3.6.2/nf_test/test_write.F:919: undefined reference to 
`_nf_rename_att_'
/home/auroux/netcdf-3.6.2/nf_test/test_write.F:931: undefined reference to 
`_nf_close_'
/home/auroux/netcdf-3.6.2/nf_test/test_write.F:934: undefined reference to 
`_nf_open_'
/home/auroux/netcdf-3.6.2/nf_test/test_write.F:944: undefined reference to 
`__gfortran_concat_string'
/home/auroux/netcdf-3.6.2/nf_test/test_write.F:945: undefined reference to 
`_nf_inq_attname_'
/home/auroux/netcdf-3.6.2/nf_test/test_write.F:949: undefined reference to 
`__gfortran_compare_string'
/home/auroux/netcdf-3.6.2/nf_test/test_write.F:950: undefined reference to 
`_nf_inq_att_'
/home/auroux/netcdf-3.6.2/nf_test/test_write.F:972: undefined reference to 
`_nf_get_att_double_'
/home/auroux/netcdf-3.6.2/nf_test/test_write.F:1008: undefined reference to 
`_nf_inq_attid_'
/home/auroux/netcdf-3.6.2/nf_test/test_write.F:1000: undefined reference to 
`__gfortran_concat_string'
/home/auroux/netcdf-3.6.2/nf_test/test_write.F:1001: undefined reference to 
`__gfortran_concat_string'
/home/auroux/netcdf-3.6.2/nf_test/test_write.F:1002: undefined reference to 
`_nf_rename_att_'
/home/auroux/netcdf-3.6.2/nf_test/test_write.F:1005: undefined reference to 
`_nf_rename_att_'
/home/auroux/netcdf-3.6.2/nf_test/test_write.F:958: undefined reference to 
`_nf_get_att_text_'
/home/auroux/netcdf-3.6.2/nf_test/test_write.F:1016: undefined reference to 
`_nf_close_'
/home/auroux/netcdf-3.6.2/nf_test/test_write.F:1020: undefined reference to 
`_nf_delete_'
test_write.o: In function `test_nf_copy_att_':
/home/auroux/netcdf-3.6.2/nf_test/test_write.F:745: undefined reference to 
`_nf_open_'
/home/auroux/netcdf-3.6.2/nf_test/test_write.F:748: undefined reference to 
`_nf_create_'
/home/auroux/netcdf-3.6.2/nf_test/test_write.F:780: undefined reference to 
`_nf_copy_att_'
/home/auroux/netcdf-3.6.2/nf_test/test_write.F:761: undefined reference to 
`_nf_copy_att_'
/home/auroux/netcdf-3.6.2/nf_test/test_write.F:765: undefined reference to 
`_nf_copy_att_'
/home/auroux/netcdf-3.6.2/nf_test/test_write.F:768: undefined reference to 
`_nf_copy_att_'
/home/auroux/netcdf-3.6.2/nf_test/test_write.F:771: undefined reference to 
`_nf_copy_att_'
test_write.o:/home/auroux/netcdf-3.6.2/nf_test/test_write.F:774: more undefined 
references to `_nf_copy_att_' follow
test_write.o: In function `test_nf_copy_att_':
/home/auroux/netcdf-3.6.2/nf_test/test_write.F:786: undefined reference to 
`_nf_close_'
/home/auroux/netcdf-3.6.2/nf_test/test_write.F:791: undefined reference to 
`_nf_close_'
/home/auroux/netcdf-3.6.2/nf_test/test_write.F:794: undefined reference to 
`_nf_open_'
/home/auroux/netcdf-3.6.2/nf_test/test_write.F:802: undefined reference to 
`_nf_redef_'
/home/auroux/netcdf-3.6.2/nf_test/test_write.F:805: undefined reference to 
`_nf_put_att_text_'
/home/auroux/netcdf-3.6.2/nf_test/test_write.F:814: undefined reference to 
`_nf_enddef_'
/home/auroux/netcdf-3.6.2/nf_test/test_write.F:819: undefined reference to 
`_nf_rename_att_'
/home/auroux/netcdf-3.6.2/nf_test/test_write.F:823: undefined reference to 
`_nf_copy_att_'
/home/auroux/netcdf-3.6.2/nf_test/test_write.F:828: undefined reference to 
`_nf_close_'
/home/auroux/netcdf-3.6.2/nf_test/test_write.F:833: undefined reference to 
`_nf_open_'
/home/auroux/netcdf-3.6.2/nf_test/test_write.F:838: undefined reference to 
`_nf_inq_att_'
/home/auroux/netcdf-3.6.2/nf_test/test_write.F:845: undefined reference to 
`_nf_get_att_text_'
/home/auroux/netcdf-3.6.2/nf_test/test_write.F:853: undefined reference to 
`_nf_close_'
/home/auroux/netcdf-3.6.2/nf_test/test_write.F:856: undefined reference to 
`_nf_delete_'
test_write.o: In function `test_nf_rename_var_':
/home/auroux/netcdf-3.6.2/nf_test/test_write.F:657: undefined reference to 
`_nf_create_'
/home/auroux/netcdf-3.6.2/nf_test/test_write.F:662: undefined reference to 
`_nf_rename_var_'
/home/auroux/netcdf-3.6.2/nf_test/test_write.F:680: undefined reference to 
`_nf_inq_varid_'
/home/auroux/netcdf-3.6.2/nf_test/test_write.F:670: undefined reference to 
`_nf_rename_var_'
/home/auroux/netcdf-3.6.2/nf_test/test_write.F:673: undefined reference to 
`_nf_rename_var_'
/home/auroux/netcdf-3.6.2/nf_test/test_write.F:676: undefined reference to 
`__gfortran_concat_string'
/home/auroux/netcdf-3.6.2/nf_test/test_write.F:677: undefined reference to 
`_nf_rename_var_'
/home/auroux/netcdf-3.6.2/nf_test/test_write.F:689: undefined reference to 
`_nf_enddef_'
/home/auroux/netcdf-3.6.2/nf_test/test_write.F:700: undefined reference to 
`_nf_inq_varid_'
/home/auroux/netcdf-3.6.2/nf_test/test_write.F:693: undefined reference to 
`__gfortran_concat_string'
/home/auroux/netcdf-3.6.2/nf_test/test_write.F:694: undefined reference to 
`_nf_rename_var_'
/home/auroux/netcdf-3.6.2/nf_test/test_write.F:697: undefined reference to 
`_nf_rename_var_'
/home/auroux/netcdf-3.6.2/nf_test/test_write.F:710: undefined reference to 
`_nf_close_'
/home/auroux/netcdf-3.6.2/nf_test/test_write.F:714: undefined reference to 
`_nf_delete_'
test_write.o: In function `test_nf_def_var_':
/home/auroux/netcdf-3.6.2/nf_test/test_write.F:562: undefined reference to 
`_nf_def_var_'
/home/auroux/netcdf-3.6.2/nf_test/test_write.F:567: undefined reference to 
`_nf_create_'
/home/auroux/netcdf-3.6.2/nf_test/test_write.F:572: undefined reference to 
`_nf_def_var_'
/home/auroux/netcdf-3.6.2/nf_test/test_write.F:576: undefined reference to 
`_nf_inq_var_'
/home/auroux/netcdf-3.6.2/nf_test/test_write.F:580: undefined reference to 
`__gfortran_compare_string'
/home/auroux/netcdf-3.6.2/nf_test/test_write.F:585: undefined reference to 
`_nf_def_var_'
/home/auroux/netcdf-3.6.2/nf_test/test_write.F:588: undefined reference to 
`_nf_def_var_'
/home/auroux/netcdf-3.6.2/nf_test/test_write.F:591: undefined reference to 
`_nf_def_var_'
/home/auroux/netcdf-3.6.2/nf_test/test_write.F:594: undefined reference to 
`_nf_def_var_'
/home/auroux/netcdf-3.6.2/nf_test/test_write.F:597: undefined reference to 
`_nf_enddef_'
/home/auroux/netcdf-3.6.2/nf_test/test_write.F:600: undefined reference to 
`_nf_def_var_'
/home/auroux/netcdf-3.6.2/nf_test/test_write.F:603: undefined reference to 
`_nf_close_'
/home/auroux/netcdf-3.6.2/nf_test/test_write.F:606: undefined reference to 
`_nf_delete_'
/home/auroux/netcdf-3.6.2/nf_test/test_write.F:611: undefined reference to 
`_nf_create_'
/home/auroux/netcdf-3.6.2/nf_test/test_write.F:619: undefined reference to 
`_nf_def_var_'
/home/auroux/netcdf-3.6.2/nf_test/test_write.F:628: undefined reference to 
`_nf_def_var_'
/home/auroux/netcdf-3.6.2/nf_test/test_write.F:631: undefined reference to 
`_nf_close_'
/home/auroux/netcdf-3.6.2/nf_test/test_write.F:635: undefined reference to 
`_nf_delete_'
test_write.o: In function `test_nf_rename_dim_':
/home/auroux/netcdf-3.6.2/nf_test/test_write.F:503: undefined reference to 
`_nf_rename_dim_'
/home/auroux/netcdf-3.6.2/nf_test/test_write.F:508: undefined reference to 
`_nf_create_'
/home/auroux/netcdf-3.6.2/nf_test/test_write.F:514: undefined reference to 
`_nf_rename_dim_'
/home/auroux/netcdf-3.6.2/nf_test/test_write.F:517: undefined reference to 
`_nf_rename_dim_'
/home/auroux/netcdf-3.6.2/nf_test/test_write.F:520: undefined reference to 
`_nf_inq_dimname_'
/home/auroux/netcdf-3.6.2/nf_test/test_write.F:522: undefined reference to 
`__gfortran_compare_string'
/home/auroux/netcdf-3.6.2/nf_test/test_write.F:523: undefined reference to 
`_nf_rename_dim_'
/home/auroux/netcdf-3.6.2/nf_test/test_write.F:527: undefined reference to 
`_nf_close_'
/home/auroux/netcdf-3.6.2/nf_test/test_write.F:530: undefined reference to 
`_nf_delete_'
test_write.o: In function `test_nf_def_dim_':
/home/auroux/netcdf-3.6.2/nf_test/test_write.F:412: undefined reference to 
`_nf_def_dim_'
/home/auroux/netcdf-3.6.2/nf_test/test_write.F:417: undefined reference to 
`_nf_create_'
/home/auroux/netcdf-3.6.2/nf_test/test_write.F:422: undefined reference to 
`_nf_enddef_'
/home/auroux/netcdf-3.6.2/nf_test/test_write.F:425: undefined reference to 
`_nf_def_dim_'
/home/auroux/netcdf-3.6.2/nf_test/test_write.F:430: undefined reference to 
`_nf_redef_'
/home/auroux/netcdf-3.6.2/nf_test/test_write.F:433: undefined reference to 
`_nf_def_dim_'
/home/auroux/netcdf-3.6.2/nf_test/test_write.F:438: undefined reference to 
`_nf_inq_unlimdim_'
/home/auroux/netcdf-3.6.2/nf_test/test_write.F:443: undefined reference to 
`_nf_inq_dimlen_'
/home/auroux/netcdf-3.6.2/nf_test/test_write.F:446: undefined reference to 
`_nf_def_dim_'
/home/auroux/netcdf-3.6.2/nf_test/test_write.F:453: undefined reference to 
`_nf_def_dim_'
/home/auroux/netcdf-3.6.2/nf_test/test_write.F:456: undefined reference to 
`_nf_def_dim_'
/home/auroux/netcdf-3.6.2/nf_test/test_write.F:460: undefined reference to 
`_nf_def_dim_'
/home/auroux/netcdf-3.6.2/nf_test/test_write.F:463: undefined reference to 
`_nf_def_dim_'
/home/auroux/netcdf-3.6.2/nf_test/test_write.F:472: undefined reference to 
`_nf_enddef_'
/home/auroux/netcdf-3.6.2/nf_test/test_write.F:480: undefined reference to 
`_nf_close_'
/home/auroux/netcdf-3.6.2/nf_test/test_write.F:483: undefined reference to 
`_nf_delete_'
test_write.o: In function `test_nf_abort_':
/home/auroux/netcdf-3.6.2/nf_test/test_write.F:304: undefined reference to 
`_nf_abort_'
/home/auroux/netcdf-3.6.2/nf_test/test_write.F:309: undefined reference to 
`_nf_create_'
/home/auroux/netcdf-3.6.2/nf_test/test_write.F:317: undefined reference to 
`_nf_abort_'
/home/auroux/netcdf-3.6.2/nf_test/test_write.F:320: undefined reference to 
`_nf_close_'
/home/auroux/netcdf-3.6.2/nf_test/test_write.F:323: undefined reference to 
`_nf_delete_'
/home/auroux/netcdf-3.6.2/nf_test/test_write.F:331: undefined reference to 
`_nf_create_'
/home/auroux/netcdf-3.6.2/nf_test/test_write.F:336: undefined reference to 
`_nf_enddef_'
/home/auroux/netcdf-3.6.2/nf_test/test_write.F:339: undefined reference to 
`_nf_redef_'
/home/auroux/netcdf-3.6.2/nf_test/test_write.F:345: undefined reference to 
`_nf_abort_'
/home/auroux/netcdf-3.6.2/nf_test/test_write.F:348: undefined reference to 
`_nf_close_'
/home/auroux/netcdf-3.6.2/nf_test/test_write.F:351: undefined reference to 
`_nf_open_'
/home/auroux/netcdf-3.6.2/nf_test/test_write.F:354: undefined reference to 
`_nf_inq_'
/home/auroux/netcdf-3.6.2/nf_test/test_write.F:363: undefined reference to 
`_nf_close_'
/home/auroux/netcdf-3.6.2/nf_test/test_write.F:368: undefined reference to 
`_nf_create_'
/home/auroux/netcdf-3.6.2/nf_test/test_write.F:376: undefined reference to 
`_nf_enddef_'
/home/auroux/netcdf-3.6.2/nf_test/test_write.F:380: undefined reference to 
`_nf_abort_'
/home/auroux/netcdf-3.6.2/nf_test/test_write.F:383: undefined reference to 
`_nf_close_'
/home/auroux/netcdf-3.6.2/nf_test/test_write.F:387: undefined reference to 
`_nf_delete_'
/home/auroux/netcdf-3.6.2/nf_test/test_write.F:320: undefined reference to 
`_nf_close_'
test_write.o: In function `test_nf_sync_':
/home/auroux/netcdf-3.6.2/nf_test/test_write.F:236: undefined reference to 
`_nf_sync_'
/home/auroux/netcdf-3.6.2/nf_test/test_write.F:241: undefined reference to 
`_nf_create_'
/home/auroux/netcdf-3.6.2/nf_test/test_write.F:246: undefined reference to 
`_nf_sync_'
/home/auroux/netcdf-3.6.2/nf_test/test_write.F:254: undefined reference to 
`_nf_enddef_'
/home/auroux/netcdf-3.6.2/nf_test/test_write.F:258: undefined reference to 
`_nf_sync_'
/home/auroux/netcdf-3.6.2/nf_test/test_write.F:263: undefined reference to 
`_nf_open_'
/home/auroux/netcdf-3.6.2/nf_test/test_write.F:266: undefined reference to 
`_nf_sync_'
/home/auroux/netcdf-3.6.2/nf_test/test_write.F:274: undefined reference to 
`_nf_close_'
/home/auroux/netcdf-3.6.2/nf_test/test_write.F:277: undefined reference to 
`_nf_close_'
/home/auroux/netcdf-3.6.2/nf_test/test_write.F:281: undefined reference to 
`_nf_delete_'
/home/auroux/netcdf-3.6.2/nf_test/test_write.F:266: undefined reference to 
`_nf_sync_'
/home/auroux/netcdf-3.6.2/nf_test/test_write.F:277: undefined reference to 
`_nf_close_'
test_write.o: In function `test_nf_redef_':
/home/auroux/netcdf-3.6.2/nf_test/test_write.F:114: undefined reference to 
`_nf_redef_'
/home/auroux/netcdf-3.6.2/nf_test/test_write.F:117: undefined reference to 
`_nf_enddef_'
/home/auroux/netcdf-3.6.2/nf_test/test_write.F:122: undefined reference to 
`_nf_open_'
/home/auroux/netcdf-3.6.2/nf_test/test_write.F:125: undefined reference to 
`_nf_redef_'
/home/auroux/netcdf-3.6.2/nf_test/test_write.F:128: undefined reference to 
`_nf_enddef_'
/home/auroux/netcdf-3.6.2/nf_test/test_write.F:131: undefined reference to 
`_nf_close_'
/home/auroux/netcdf-3.6.2/nf_test/test_write.F:136: undefined reference to 
`_nf_create_'
/home/auroux/netcdf-3.6.2/nf_test/test_write.F:144: undefined reference to 
`_nf_inq_varid_'
/home/auroux/netcdf-3.6.2/nf_test/test_write.F:148: undefined reference to 
`_nf_put_var1_double_'
/home/auroux/netcdf-3.6.2/nf_test/test_write.F:151: undefined reference to 
`_nf_redef_'
/home/auroux/netcdf-3.6.2/nf_test/test_write.F:154: undefined reference to 
`_nf_enddef_'
/home/auroux/netcdf-3.6.2/nf_test/test_write.F:158: undefined reference to 
`_nf_def_dim_'
/home/auroux/netcdf-3.6.2/nf_test/test_write.F:161: undefined reference to 
`_nf_redef_'
/home/auroux/netcdf-3.6.2/nf_test/test_write.F:164: undefined reference to 
`_nf_def_dim_'
/home/auroux/netcdf-3.6.2/nf_test/test_write.F:167: undefined reference to 
`_nf_def_var_'
/home/auroux/netcdf-3.6.2/nf_test/test_write.F:171: undefined reference to 
`_nf_put_att_text_'
/home/auroux/netcdf-3.6.2/nf_test/test_write.F:174: undefined reference to 
`_nf_enddef_'
/home/auroux/netcdf-3.6.2/nf_test/test_write.F:178: undefined reference to 
`_nf_put_var1_double_'
/home/auroux/netcdf-3.6.2/nf_test/test_write.F:181: undefined reference to 
`_nf_close_'
/home/auroux/netcdf-3.6.2/nf_test/test_write.F:187: undefined reference to 
`_nf_open_'
/home/auroux/netcdf-3.6.2/nf_test/test_write.F:190: undefined reference to 
`_nf_inq_dim_'
/home/auroux/netcdf-3.6.2/nf_test/test_write.F:194: undefined reference to 
`__gfortran_compare_string'
/home/auroux/netcdf-3.6.2/nf_test/test_write.F:197: undefined reference to 
`_nf_get_var1_double_'
/home/auroux/netcdf-3.6.2/nf_test/test_write.F:203: undefined reference to 
`_nf_close_'
/home/auroux/netcdf-3.6.2/nf_test/test_write.F:207: undefined reference to 
`_nf_delete_'
/home/auroux/netcdf-3.6.2/nf_test/test_write.F:174: undefined reference to 
`_nf_enddef_'
/home/auroux/netcdf-3.6.2/nf_test/test_write.F:181: undefined reference to 
`_nf_close_'
test_write.o: In function `test_nf_create_':
/home/auroux/netcdf-3.6.2/nf_test/test_write.F:29: undefined reference to 
`_nf_create_'
/home/auroux/netcdf-3.6.2/nf_test/test_write.F:33: undefined reference to 
`_nf_close_'
/home/auroux/netcdf-3.6.2/nf_test/test_write.F:37: undefined reference to 
`_nf_open_'
/home/auroux/netcdf-3.6.2/nf_test/test_write.F:41: undefined reference to 
`_nf_inq_'
/home/auroux/netcdf-3.6.2/nf_test/test_write.F:61: undefined reference to 
`_nf_close_'
/home/auroux/netcdf-3.6.2/nf_test/test_write.F:69: undefined reference to 
`_nf_create_'
/home/auroux/netcdf-3.6.2/nf_test/test_write.F:73: undefined reference to 
`_nf_delete_'
/home/auroux/netcdf-3.6.2/nf_test/test_write.F:33: undefined reference to 
`_nf_close_'
/home/auroux/netcdf-3.6.2/nf_test/test_write.F:61: undefined reference to 
`_nf_close_'
util.o: In function `external_max_':
/home/auroux/netcdf-3.6.2/nf_test/util.F:1420: undefined reference to 
`__gfortran_stop_string'
util.o: In function `external_min_':
/home/auroux/netcdf-3.6.2/nf_test/util.F:1394: undefined reference to 
`__gfortran_stop_string'
util.o: In function `char2type_':
/home/auroux/netcdf-3.6.2/nf_test/util.F:556: undefined reference to 
`__gfortran_stop_string'
util.o: In function `internal_max_':
/home/auroux/netcdf-3.6.2/nf_test/util.F:1368: undefined reference to 
`__gfortran_stop_string'
util.o: In function `internal_min_':
/home/auroux/netcdf-3.6.2/nf_test/util.F:1293: undefined reference to 
`_max_double_'
/home/auroux/netcdf-3.6.2/nf_test/util.F:1285: undefined reference to 
`_max_float_'
/home/auroux/netcdf-3.6.2/nf_test/util.F:1300: undefined reference to 
`__gfortran_stop_string'
util.o: In function `check_file_':
/home/auroux/netcdf-3.6.2/nf_test/util.F:1152: undefined reference to 
`_nf_open_'
/home/auroux/netcdf-3.6.2/nf_test/util.F:1159: undefined reference to 
`_nf_close_'
util.o: In function `check_atts_':
/home/auroux/netcdf-3.6.2/nf_test/util.F:1082: undefined reference to 
`_nf_inq_attname_'
/home/auroux/netcdf-3.6.2/nf_test/util.F:1086: undefined reference to 
`__gfortran_compare_string'
/home/auroux/netcdf-3.6.2/nf_test/util.F:1090: undefined reference to 
`_nf_inq_att_'
/home/auroux/netcdf-3.6.2/nf_test/util.F:1119: undefined reference to 
`_nf_get_att_double_'
/home/auroux/netcdf-3.6.2/nf_test/util.F:1103: undefined reference to 
`_nf_get_att_text_'
util.o: In function `check_vars_':
/home/auroux/netcdf-3.6.2/nf_test/util.F:991: undefined reference to 
`_nf_inq_var_'
/home/auroux/netcdf-3.6.2/nf_test/util.F:995: undefined reference to 
`__gfortran_compare_string'
/home/auroux/netcdf-3.6.2/nf_test/util.F:1005: undefined reference to 
`_nf_inq_dim_'
/home/auroux/netcdf-3.6.2/nf_test/util.F:1033: undefined reference to 
`_nf_get_var1_double_'
/home/auroux/netcdf-3.6.2/nf_test/util.F:1022: undefined reference to 
`_nf_get_var1_text_'
util.o: In function `check_dims_':
/home/auroux/netcdf-3.6.2/nf_test/util.F:952: undefined reference to 
`__gfortran_compare_string'
/home/auroux/netcdf-3.6.2/nf_test/util.F:948: undefined reference to 
`_nf_inq_dim_'
util.o: In function `write_file_':
/home/auroux/netcdf-3.6.2/nf_test/util.F:913: undefined reference to 
`_nf_create_'
/home/auroux/netcdf-3.6.2/nf_test/util.F:921: undefined reference to 
`_nf_enddef_'
/home/auroux/netcdf-3.6.2/nf_test/util.F:927: undefined reference to 
`_nf_close_'
util.o: In function `put_vars_':
/home/auroux/netcdf-3.6.2/nf_test/util.F:881: undefined reference to 
`_nf_put_vara_text_'
/home/auroux/netcdf-3.6.2/nf_test/util.F:887: undefined reference to 
`_nf_put_vara_double_'
util.o: In function `put_atts_':
/home/auroux/netcdf-3.6.2/nf_test/util.F:815: undefined reference to 
`_nf_put_att_double_'
/home/auroux/netcdf-3.6.2/nf_test/util.F:815: undefined reference to 
`_nf_put_att_double_'
/home/auroux/netcdf-3.6.2/nf_test/util.F:800: undefined reference to 
`_nf_put_att_text_'
util.o: In function `def_vars_':
/home/auroux/netcdf-3.6.2/nf_test/util.F:755: undefined reference to 
`_nf_def_var_'
util.o: In function `def_dims_':
/home/auroux/netcdf-3.6.2/nf_test/util.F:734: undefined reference to 
`_nf_def_dim_'
/home/auroux/netcdf-3.6.2/nf_test/util.F:731: undefined reference to 
`_nf_def_dim_'
util.o: In function `init_gvars_':
/home/auroux/netcdf-3.6.2/nf_test/util.F:696: undefined reference to 
`__gfortran_stop_string'
util.o: In function `init_dims_':
/home/auroux/netcdf-3.6.2/nf_test/util.F:573: undefined reference to 
`__gfortran_concat_string'
/home/auroux/netcdf-3.6.2/nf_test/util.F:573: undefined reference to 
`__gfortran_concat_string'
/home/auroux/netcdf-3.6.2/nf_test/util.F:573: undefined reference to 
`__gfortran_concat_string'
util.o: In function `init_gatts_':
/home/auroux/netcdf-3.6.2/nf_test/util.F:587: undefined reference to 
`__gfortran_concat_string'
util.o: In function `hash_':
/home/auroux/netcdf-3.6.2/nf_test/util.F:503: undefined reference to 
`__gfortran_stop_string'
util.o: In function `print_nok_':
/home/auroux/netcdf-3.6.2/nf_test/util.F:13: undefined reference to 
`__gfortran_st_write'
/home/auroux/netcdf-3.6.2/nf_test/util.F:13: undefined reference to 
`__gfortran_transfer_character'
/home/auroux/netcdf-3.6.2/nf_test/util.F:13: undefined reference to 
`__gfortran_st_write_done'
/home/auroux/netcdf-3.6.2/nf_test/util.F:14: undefined reference to 
`__gfortran_st_write'
/home/auroux/netcdf-3.6.2/nf_test/util.F:14: undefined reference to 
`__gfortran_transfer_integer'
/home/auroux/netcdf-3.6.2/nf_test/util.F:14: undefined reference to 
`__gfortran_transfer_character'
/home/auroux/netcdf-3.6.2/nf_test/util.F:14: undefined reference to 
`__gfortran_st_write_done'
util.o: In function `internal_max_':
/home/auroux/netcdf-3.6.2/nf_test/util.F:1361: undefined reference to 
`_max_double_'
/home/auroux/netcdf-3.6.2/nf_test/util.F:1345: undefined reference to 
`_max_int_'
/home/auroux/netcdf-3.6.2/nf_test/util.F:1323: undefined reference to 
`_max_schar_'
/home/auroux/netcdf-3.6.2/nf_test/util.F:1335: undefined reference to 
`_max_short_'
/home/auroux/netcdf-3.6.2/nf_test/util.F:1353: undefined reference to 
`_max_float_'
util.o: In function `internal_min_':
/home/auroux/netcdf-3.6.2/nf_test/util.F:1277: undefined reference to 
`_min_int_'
/home/auroux/netcdf-3.6.2/nf_test/util.F:1255: undefined reference to 
`_min_schar_'
/home/auroux/netcdf-3.6.2/nf_test/util.F:1267: undefined reference to 
`_min_short_'
collect2: ld returned 1 exit status
make[2]: *** [nf_test.exe] Error 1
make[2]: Leaving directory `/home/auroux/netcdf-3.6.2/nf_test'
make[1]: *** [check-am] Error 2
make[1]: Leaving directory `/home/auroux/netcdf-3.6.2/nf_test'
make: *** [check-recursive] Error 1

configure: netCDF 3.6.2
checking build system type... i686-pc-cygwin
checking host system type... i686-pc-cygwin
checking for a BSD-compatible install... /usr/bin/install -c
checking whether build environment is sane... yes
checking for gawk... gawk
checking whether make sets $(MAKE)... yes
configure: checking user options
checking whether CXX is set to ''... no
checking whether FC is set to ''... no
checking whether F90 is set to ''... yes
checking whether documentation is to be installed... no
checking whether Fortran compiler(s) should be tested during configure... yes
checking whether configure should try to set compiler flags... yes
checking whether FFIO will be used... no
checking whether to skip C++, F77, or F90 APIs if compiler is broken... yes
checking whether only the C library is desired... no
checking whether examples should be built... yes
checking whether F77 API is desired... yes
checking whether F90 API is desired... no
checking whether fortran type sizes should be checked... yes
checking whether C API is desired... yes
checking where to get netCDF C-only library for separate fortran libraries... 
checking whether CXX API is desired... yes
checking whether v2 netCDF API should be built... yes
checking whether the ncgen/ncdump should be built... yes
checking whether large file (> 2GB) tests should be run... no
checking whether extreme numbers should be used in tests... yes
checking where to put large temp files if large file tests are run... .
checking whether a win32 DLL is desired... no
checking whether separate fortran libs are desired... no
configure: finding C compiler
checking for C compiler default output file name... a.exe
checking whether the C compiler works... yes
checking whether we are cross compiling... no
checking for suffix of executables... .exe
checking for suffix of object files... o
checking whether we are using the GNU C compiler... yes
checking whether gcc accepts -g... yes
checking for gcc option to accept ISO C89... none needed
checking for style of include used by make... GNU
checking dependency style of gcc... gcc3
checking whether gcc and cc understand -c and -o together... yes
checking for an ANSI C-conforming const... yes
configure: finding Fortran compiler (will not be used if Fortran API is not 
desired)
checking whether we are using the GNU Fortran compiler... yes
checking whether g77 accepts -g... yes
checking whether we are using the GNU Fortran 77 compiler... yes
checking whether g77 accepts -g... yes
configure: finding C++ compiler (will not be used if C++ API is not desired)
checking whether we are using the GNU C++ compiler... yes
checking whether g++ accepts -g... yes
checking dependency style of g++... gcc3
checking for as... as
checking for dlltool... dlltool
checking for objdump... objdump
checking for a sed that does not truncate output... /usr/bin/sed
checking for grep that handles long lines and -e... /usr/bin/grep
checking for egrep... /usr/bin/grep -E
checking for fgrep... /usr/bin/grep -F
checking for ld used by gcc... /usr/i686-pc-cygwin/bin/ld.exe
checking if the linker (/usr/i686-pc-cygwin/bin/ld.exe) is GNU ld... yes
checking for BSD- or MS-compatible name lister (nm)... /usr/bin/nm -B
checking the name lister (/usr/bin/nm -B) interface... BSD nm
checking whether ln -s works... yes
checking the maximum length of command line arguments... 8192
checking whether the shell understands some XSI constructs... yes
checking whether the shell understands "+="... yes
checking for /usr/i686-pc-cygwin/bin/ld.exe option to reload object files... -r
checking how to recognise dependent libraries... file_magic ^x86 archive 
import|^x86 DLL
checking for ar... ar
checking for strip... strip
checking for ranlib... ranlib
checking command to parse /usr/bin/nm -B output from gcc object... ok
checking how to run the C preprocessor... gcc -E
checking for ANSI C header files... yes
checking for sys/types.h... yes
checking for sys/stat.h... yes
checking for stdlib.h... yes
checking for string.h... yes
checking for memory.h... yes
checking for strings.h... yes
checking for inttypes.h... yes
checking for stdint.h... yes
checking for unistd.h... yes
checking for dlfcn.h... yes
checking whether we are using the GNU C++ compiler... (cached) yes
checking whether g++ accepts -g... (cached) yes
checking dependency style of g++... (cached) gcc3
checking how to run the C++ preprocessor... g++ -E
checking whether we are using the GNU Fortran 77 compiler... (cached) yes
checking whether g77 accepts -g... (cached) yes
checking whether we are using the GNU Fortran compiler... (cached) yes
checking whether g77 accepts -g... (cached) yes
checking for objdir... .libs
checking if gcc supports -fno-rtti -fno-exceptions... no
checking for gcc option to produce PIC...  -DPIC
checking if gcc PIC flag  -DPIC works... yes
checking if gcc static flag -static works... yes
checking if gcc supports -c -o file.o... yes
checking if gcc supports -c -o file.o... (cached) yes
checking whether the gcc linker (/usr/i686-pc-cygwin/bin/ld.exe) supports 
shared libraries... yes
checking dynamic linker characteristics... Win32 ld.exe
checking how to hardcode library paths into programs... immediate
checking whether stripping libraries is possible... yes
checking if libtool supports shared libraries... yes
checking whether to build shared libraries... no
checking whether to build static libraries... yes
checking for ld used by g++... /usr/i686-pc-cygwin/bin/ld.exe
checking if the linker (/usr/i686-pc-cygwin/bin/ld.exe) is GNU ld... yes
checking whether the g++ linker (/usr/i686-pc-cygwin/bin/ld.exe) supports 
shared libraries... yes
checking for g++ option to produce PIC...  -DPIC
checking if g++ PIC flag  -DPIC works... yes
checking if g++ static flag -static works... yes
checking if g++ supports -c -o file.o... yes
checking if g++ supports -c -o file.o... (cached) yes
checking whether the g++ linker (/usr/i686-pc-cygwin/bin/ld.exe) supports 
shared libraries... yes
checking dynamic linker characteristics... Win32 ld.exe
checking how to hardcode library paths into programs... immediate
checking if libtool supports shared libraries... yes
checking whether to build shared libraries... no
checking whether to build static libraries... yes
checking for g77 option to produce PIC... 
checking if g77 static flag -static works... yes
checking if g77 supports -c -o file.o... yes
checking if g77 supports -c -o file.o... (cached) yes
checking whether the g77 linker (/usr/i686-pc-cygwin/bin/ld.exe) supports 
shared libraries... yes
checking dynamic linker characteristics... Win32 ld.exe
checking how to hardcode library paths into programs... immediate
checking if libtool supports shared libraries... yes
checking whether to build shared libraries... no
checking whether to build static libraries... yes
checking for g77 option to produce PIC... 
checking if g77 static flag -static works... yes
checking if g77 supports -c -o file.o... yes
checking if g77 supports -c -o file.o... (cached) yes
checking whether the g77 linker (/usr/i686-pc-cygwin/bin/ld.exe) supports 
shared libraries... yes
checking dynamic linker characteristics... Win32 ld.exe
checking how to hardcode library paths into programs... immediate
configure: finding other utilities
checking for a BSD-compatible install... /usr/bin/install -c
configure: trying to set fortran flags for this platform
configure: trying to set flags for this platform
checking if _HPUX_SOURCE should be set... no
checking if Solaris -Xa option is needed... CFLAGS=-g -O2
checking if we need to set _LARGE_FILES despite results of previous tests... 
_LARGE_FILES
checking for special C compiler options needed for large files... no
checking for _FILE_OFFSET_BITS value needed for large files... no
configure: displaying some results
checking CPPFLAGS... -Df2cFortran
checking CC CFLAGS... gcc -g -O2
checking type gcc... gcc is /usr/bin/gcc
checking CXX... g++
checking CXXFLAGS... -g -O2
checking type g++... g++ is /usr/bin/g++
checking FC... g77
checking FFLAGS... -Wno-globals
checking type g77... g77 is /usr/bin/g77
checking F90... unset
checking AR... ar
checking ARFLAGS... 
checking type ar... ar is /usr/bin/ar
checking NM... /usr/bin/nm -B
checking NMFLAGS... 
checking for /usr/bin/nm... /usr/bin/nm -B
checking nm flags... 
checking for C-equivalent to Fortran routine "SUB"... sub_
checking for Fortran "byte"... yes
checking for Fortran "integer*2"... yes
checking if Fortran "byte" is C "signed char"... yes
checking if Fortran "byte" is C "short"... no
checking if Fortran "byte" is C "int"... no
checking if Fortran "byte" is C "long"... no
checking if Fortran "integer*2" is C "short"... yes
checking if Fortran "integer*2" is C "int"... no
checking if Fortran "integer*2" is C "long"... no
checking if Fortran "integer" is C "int"... yes
checking if Fortran "real" is C "float"... yes
checking if Fortran "doubleprecision" is C "double"... yes
checking for Fortran-equivalent to netCDF "byte"... byte
checking for Fortran-equivalent to netCDF "short"... integer*2
configure: checking types, headers, and functions
checking for stdlib.h... (cached) yes
checking for sys/types.h... (cached) yes
checking for strlcat... yes
checking for strerror... yes
checking for working alloca.h... yes
checking for alloca... yes
checking for struct stat.st_blksize... yes
checking for IEEE floating point format... yes
checking for size_t... yes
checking for off_t... yes
checking for ssize_t... yes
checking for ptrdiff_t... yes
checking for uchar... no
checking whether char is unsigned... no
checking whether byte ordering is bigendian... no
checking for short... yes
checking size of short... 2
checking for int... yes
checking size of int... 4
checking for long... yes
checking size of long... 4
checking for float... yes
checking size of float... 4
checking for double... yes
checking size of double... 8
checking for off_t... (cached) yes
checking size of off_t... 8
checking for size_t... (cached) yes
checking size of size_t... 4
checking for catman... no
checking for makewhatis... no
checking for /usr/lib/makewhatis... no
checking for manual-page index command... 
checking binary distribution directory... /home/ftp/pub/binary/dummy_system
configure: generating header files and makefiles
configure: creating ./config.status
config.status: creating Makefile
config.status: creating man/Makefile
config.status: creating fortran/Makefile
config.status: creating libsrc/Makefile
config.status: creating nctest/Makefile
config.status: creating nc_test/Makefile
config.status: creating ncdump/Makefile
config.status: creating ncgen/Makefile
config.status: creating nf_test/Makefile
config.status: creating cxx/Makefile
config.status: creating f90/Makefile
config.status: creating examples/Makefile
config.status: creating examples/C/Makefile
config.status: creating examples/CDL/Makefile
config.status: creating examples/CXX/Makefile
config.status: creating examples/F90/Makefile
config.status: creating examples/F77/Makefile
config.status: creating config.h
config.status: config.h is unchanged
config.status: creating fortran/nfconfig1.inc
config.status: fortran/nfconfig1.inc is unchanged
config.status: executing depfiles commands
config.status: executing libtool commands